has definition
type: ObjectProperty
type: FunctionalProperty
domain: Cohort
range: CohortDefinition
python name: definition
comment: (for Cohort:) A foreign key to a record in the COHORT_DEFINITION table containing relevant Cohort Definition information.
omop cdm name: cohort.cohort_definition_id#1 AS CohortDefinition

has subject
type: ObjectProperty
type: FunctionalProperty
domain: Class
  union of: CohortDefinition
  union of: Cohort
python name: subject
comment: (for Cohort:) A foreign key to the subject in the cohort. These could be referring to records in the PERSON, PROVIDER, VISIT_OCCURRENCE table.
comment: (for CohortDefinition:) A foreign key to the Concept to which defines the domain of subjects that are members of the cohort (e.g., Person, Provider, Visit).
omop cdm name: cohort.subject_id#2 AS VisitOccurrence
omop cdm name: cohort_definition.subject_concept_id#10 AS Concept

has definition type
type: ObjectProperty
type: FunctionalProperty
domain: CohortDefinition
range: Concept
python name: definition_type
comment: (for CohortDefinition:) Type defining what kind of Cohort Definition the record represents and how the syntax may be executed
omop cdm name: cohort_definition.definition_type_concept_id#8 AS Concept

has condition occurrence
type: ObjectProperty
domain: Class
  union of: BaseVisit
  union of: Person
range: ConditionOccurrence
python name: condition_occurrences
comment: (reversed relation, for ConditionOccurrence:) A foreign key identifier to the Person who is experiencing the condition. The demographic details of that Person are stored in the PERSON table.
comment: (reversed relation, for ConditionOccurrence:) A foreign key to the visit in the VISIT_OCCURRENCE table during which the Condition was determined (diagnosed).
comment: (reversed relation, for ConditionOccurrence:) A foreign key to the visit in the VISIT_DETAIL table during which the Condition was determined (diagnosed).
omop cdm name: condition_occurrence.person_id#13 AS Person
omop cdm name: condition_occurrence.visit_occurrence_id#23 AS VisitOccurrence
omop cdm name: condition_occurrence.visit_detail_id#24 AS VisitDetail

has concept
type: ObjectProperty
type: FunctionalProperty
domain: Class
  union of: ConditionOccurrence
  union of: ConceptClass
  union of: DrugStrength
  union of: Cost
  union of: Exposure
  union of: ProcedureOccurrence
  union of: Metadata
  union of: Measurement
  union of: Specimen
  union of: Domain
  union of: Vocabulary
  union of: ConceptSynonym
  union of: NoteNlp
  union of: Observation
  union of: Era
  union of: BaseVisit
  union of: Relationship
range: Concept
python name: concept
comment: (for ConditionOccurrence:) A foreign key that refers to a Standard Concept identifier in the Standardized Vocabularies belonging to the 'Condition' domain.
comment: (for DeviceExposure:) A foreign key that refers to a Standard Concept identifier in the Standardized Vocabularies belonging to the 'Device' domain.
comment: (for DrugExposure:) A foreign key that refers to a Standard Concept identifier in the Standardized Vocabularies belonging to the 'Drug' domain.
comment: (for Measurement:) A foreign key to the standard measurement concept identifier in the Standardized Vocabularies. These belong to the 'Measurement' domain, but could overlap with the 'Observation' domain (see #3 below).
comment: (for NoteNlp:) A foreign key to the predefined Concept in the Standardized Vocabularies reflecting the normalized concept for the extracted term. Domain of the term is represented as part of the Concept table.
comment: (for Observation:) A foreign key to the standard observation concept identifier in the Standardized Vocabularies.
comment: (for ProcedureOccurrence:) A foreign key that refers to a standard procedure Concept identifier in the Standardized Vocabularies.
comment: (for Specimen:) A foreign key referring to a Standard Concept identifier in the Standardized Vocabularies for the Specimen.
comment: (for VisitDetail:) A foreign key that refers to a visit Concept identifier in the Standardized Vocabularies belonging to the 'Visit' Vocabulary.
comment: (for VisitOccurrence:) A foreign key that refers to a visit Concept identifier in the Standardized Vocabularies belonging to the 'Visit' Vocabulary.
comment: (for ConditionEra:) A foreign key that refers to a standard Condition Concept identifier in the Standardized Vocabularies.
comment: (for DoseEra:) A foreign key that refers to a Standard Concept identifier in the Standardized Vocabularies for the active Ingredient Concept.
comment: (for DrugEra:) A foreign key that refers to a Standard Concept identifier in the Standardized Vocabularies for the Ingredient Concept.
comment: (for Cost:) A foreign key that refers to a Standard Cost Concept identifier in the Standardized Vocabularies belonging to the 'Cost' vocabulary.
comment: (for Metadata:) A foreign key that refers to a Standard Metadata Concept identifier in the Standardized Vocabularies.
comment: (for ConceptClass:) A foreign key that refers to an identifier in the [CONCEPT](https://github.com/OHDSI/CommonDataModel/wiki/CONCEPT) table for the unique Concept Class the record belongs to.
comment: (for ConceptSynonym:) A foreign key to the Concept in the CONCEPT table.
comment: (for Domain:) A foreign key that refers to an identifier in the [CONCEPT](https://github.com/OHDSI/CommonDataModel/wiki/CONCEPT) table for the unique Domain Concept the Domain record belongs to.
comment: (for DrugStrength:) A foreign key to the Concept in the CONCEPT table representing the identifier for Branded Drug or Clinical Drug Concept.
comment: (for Relationship:) A foreign key that refers to an identifier in the CONCEPT table for the unique relationship concept.
comment: (for Vocabulary:) A foreign key that refers to a standard concept identifier in the CONCEPT table for the Vocabulary the VOCABULARY record belongs to.
omop cdm name: condition_occurrence.condition_concept_id#14 AS Concept
omop cdm name: device_exposure.device_concept_id#30 AS Concept
omop cdm name: drug_exposure.drug_concept_id#45 AS Concept
omop cdm name: measurement.measurement_concept_id#73 AS Concept
omop cdm name: note_nlp.note_nlp_concept_id#113 AS Concept
omop cdm name: observation.observation_concept_id#123 AS Concept
omop cdm name: procedure_occurrence.procedure_concept_id#168 AS Concept
omop cdm name: specimen.specimen_concept_id#182 AS Concept
omop cdm name: visit_detail.visit_detail_concept_id#221 AS Concept
omop cdm name: visit_occurrence.visit_concept_id#240 AS Concept
omop cdm name: condition_era.condition_concept_id#257 AS Concept
omop cdm name: dose_era.drug_concept_id#263 AS Concept
omop cdm name: drug_era.drug_concept_id#270 AS Concept
omop cdm name: cost.cost_concept_id#279 AS Concept
omop cdm name: metadata.metadata_concept_id#360 AS Concept
omop cdm name: concept_class.concept_class_concept_id#383 AS Concept
omop cdm name: concept_synonym.concept_id#390 AS Concept
omop cdm name: domain.domain_concept_id#395 AS Concept
omop cdm name: drug_strength.drug_concept_id#396 AS Concept
omop cdm name: relationship.relationship_concept_id#413 AS Concept
omop cdm name: vocabulary.vocabulary_concept_id#427 AS Concept

has type
type: ObjectProperty
type: FunctionalProperty
domain: Class
  union of: Measurement
  union of: Specimen
  union of: Exposure
  union of: ConditionOccurrence
  union of: Observation
  union of: ProcedureOccurrence
  union of: Metadata
  union of: Note
  union of: BaseVisit
  union of: Cost
range: Concept
python name: type
comment: (for ConditionOccurrence:) A foreign key to the predefined Concept identifier in the Standardized Vocabularies reflecting the source data from which the Condition was recorded, the level of standardization, and the type of occurrence. These belong to the 'Condition Type' vocabulary
comment: (for DeviceExposure:) A foreign key to the predefined Concept identifier in the Standardized Vocabularies reflecting the type of Device Exposure recorded. It indicates how the Device Exposure was represented in the source data and belongs to the 'Device Type' domain.
comment: (for DrugExposure:) A foreign key to the predefined Concept identifier in the Standardized Vocabularies reflecting the type of Drug Exposure recorded. It indicates how the Drug Exposure was represented in the source data and belongs to the 'Drug Type' vocabulary.
comment: (for Measurement:) A foreign key to the predefined Concept in the Standardized Vocabularies reflecting the provenance from where the Measurement record was recorded. These belong to the 'Meas Type' vocabulary
comment: (for Note:) A foreign key to the predefined Concept in the Standardized Vocabularies reflecting the type, origin or provenance of the Note. These belong to the 'Note Type' vocabulary
comment: (for Observation:) A foreign key to the predefined concept identifier in the Standardized Vocabularies reflecting the type of the observation.
comment: (for ProcedureOccurrence:) A foreign key to the predefined Concept identifier in the Standardized Vocabularies reflecting the type of source data from which the procedure record is derived, belonging to the 'Procedure Type' vocabulary.
comment: (for Specimen:) A foreign key referring to the Concept identifier in the Standardized Vocabularies reflecting the system of record from which the Specimen was represented in the source data.
comment: (for VisitDetail:) A foreign key to the predefined Concept identifier in the Standardized Vocabularies reflecting the type of source data from which the visit record is derived belonging to the 'Visit Type' vocabulary.
comment: (for VisitOccurrence:) A foreign key to the predefined Concept identifier in the Standardized Vocabularies reflecting the type of source data from which the visit record is derived belonging to the 'Visit Type' vocabulary.
comment: (for Cost:) A foreign key identifier to a concept in the CONCEPT table for the provenance or the source of the COST data and belonging to the 'Cost Type' vocabulary
comment: (for Metadata:) A foreign key that refers to a Standard Type Concept identifier in the Standardized Vocabularies.
omop cdm name: condition_occurrence.condition_type_concept_id#19 AS Concept
omop cdm name: device_exposure.device_type_concept_id#35 AS Concept
omop cdm name: drug_exposure.drug_type_concept_id#51 AS Concept
omop cdm name: measurement.measurement_type_concept_id#77 AS Concept
omop cdm name: note.note_type_concept_id#97 AS Concept
omop cdm name: observation.observation_type_concept_id#126 AS Concept
omop cdm name: procedure_occurrence.procedure_type_concept_id#171 AS Concept
omop cdm name: specimen.specimen_type_concept_id#183 AS Concept
omop cdm name: visit_detail.visit_detail_type_concept_id#226 AS Concept
omop cdm name: visit_occurrence.visit_type_concept_id#245 AS Concept
omop cdm name: cost.cost_type_concept_id#280 AS Concept
omop cdm name: metadata.metadata_type_concept_id#361 AS Concept

has status
type: ObjectProperty
type: FunctionalProperty
domain: ConditionOccurrence
range: Concept
python name: status
comment: (for ConditionOccurrence:) A foreign key that refers to a Standard Concept identifier in the Standardized Vocabularies reflecting the point of care at which the Condition was diagnosed.
omop cdm name: condition_occurrence.condition_status_concept_id#20 AS Concept

has provider
type: ObjectProperty
type: FunctionalProperty
domain: Class
  union of: Measurement
  union of: Exposure
  union of: ConditionOccurrence
  union of: Observation
  union of: ProcedureOccurrence
  union of: SurveyConduct
  union of: Person
  union of: Note
  union of: BaseVisit
range: Provider
python name: provider
comment: (for ConditionOccurrence:) A foreign key to the Provider in the PROVIDER table who was responsible for capturing (diagnosing) the Condition.
comment: (for DeviceExposure:) A foreign key to the provider in the PROVIDER table who initiated or administered the Device.
comment: (for DrugExposure:) A foreign key to the provider in the PROVIDER table who initiated (prescribed or administered) the Drug Exposure.
comment: (for Measurement:) A foreign key to the provider in the PROVIDER table who was responsible for initiating or obtaining the measurement.
comment: (for Note:) A foreign key to the Provider in the PROVIDER table who took the Note.
comment: (for Observation:) A foreign key to the provider in the PROVIDER table who was responsible for making the observation.
comment: (for Person:) A foreign key to the primary care provider the person is seeing in the provider table.
comment: (for ProcedureOccurrence:) A foreign key to the provider in the PROVIDER table who was responsible for carrying out the procedure.
comment: (for SurveyConduct:) A foreign key to the provider in the provider table who was associated with the survey completion.
comment: (for VisitDetail:) A foreign key to the provider in the provider table who was associated with the visit.
comment: (for VisitOccurrence:) A foreign key to the provider in the provider table who was associated with the visit.
omop cdm name: condition_occurrence.provider_id#22 AS Provider
omop cdm name: device_exposure.provider_id#38 AS Provider
omop cdm name: drug_exposure.provider_id#59 AS Provider
omop cdm name: measurement.provider_id#84 AS Provider
omop cdm name: note.provider_id#103 AS Provider
omop cdm name: observation.provider_id#132 AS Provider
omop cdm name: person.provider_id#157 AS Provider
omop cdm name: procedure_occurrence.provider_id#174 AS Provider
omop cdm name: survey_conduct.provider_id#202 AS Provider
omop cdm name: visit_detail.provider_id#227 AS Provider
omop cdm name: visit_occurrence.provider_id#246 AS Provider

has source
type: ObjectProperty
type: FunctionalProperty
domain: Class
  union of: Measurement
  union of: Specimen
  union of: NoteNlp
  union of: Exposure
  union of: ConditionOccurrence
  union of: Observation
  union of: ProcedureOccurrence
  union of: SourceToConceptMap
  union of: BaseVisit
  union of: Cost
python name: source
comment: (for ConditionOccurrence:) A foreign key to a Condition Concept that refers to the code used in the source.
comment: (for DeviceExposure:) A foreign key to a Device Concept that refers to the code used in the source.
comment: (for DrugExposure:) A foreign key to a Drug Concept that refers to the code used in the source.
comment: (for Measurement:) A foreign key to a Concept in the Standard Vocabularies that refers to the code used in the source.
comment: (for NoteNlp:) A foreign key to a Concept that refers to the code in the source vocabulary used by the NLP system
comment: (for Observation:) A foreign key to a Concept that refers to the code used in the source.
comment: (for ProcedureOccurrence:) A foreign key to a Procedure Concept that refers to the code used in the source.
comment: (for Specimen:) The Specimen identifier as it appears in the source data.
comment: (for VisitDetail:) A foreign key to a Concept that refers to the code used in the source.
comment: (for VisitOccurrence:) A foreign key to a Concept that refers to the code used in the source.
comment: (for Cost:) A foreign key to a Cost Concept that refers to the code used in the source.
comment: (for SourceToConceptMap:) A foreign key to the Source Concept that is being translated into a Standard Concept.
omop cdm name: condition_occurrence.condition_source_concept_id#26 AS Concept
omop cdm name: device_exposure.device_source_concept_id#42 AS Concept
omop cdm name: drug_exposure.drug_source_concept_id#63 AS Concept
omop cdm name: measurement.measurement_source_concept_id#88 AS Concept
omop cdm name: note_nlp.note_nlp_source_concept_id#114 AS Concept
omop cdm name: observation.observation_source_concept_id#136 AS Concept
omop cdm name: procedure_occurrence.procedure_source_concept_id#178 AS Concept
omop cdm name: specimen.specimen_source_id#190 AS Thing
omop cdm name: visit_detail.visit_detail_source_concept_id#230 AS Concept
omop cdm name: visit_occurrence.visit_source_concept_id#249 AS Concept
omop cdm name: cost.cost_source_concept_id#281 AS Concept
omop cdm name: source_to_concept_map.source_concept_id#415 AS Concept

has device exposure
type: ObjectProperty
domain: Class
  union of: BaseVisit
  union of: Person
range: DeviceExposure
python name: device_exposures
comment: (reversed relation, for DeviceExposure:) A foreign key identifier to the Person who is subjected to the Device. The demographic details of that Person are stored in the PERSON table.
comment: (reversed relation, for DeviceExposure:) A foreign key to the visit in the VISIT_OCCURRENCE table during which the Device was used.
comment: (reversed relation, for DeviceExposure:) A foreign key to the visit detail record in the VISIT_DETAIL table during which the Device was used.
omop cdm name: device_exposure.person_id#29 AS Person
omop cdm name: device_exposure.visit_occurrence_id#39 AS VisitOccurrence
omop cdm name: device_exposure.visit_detail_id#40 AS VisitDetail

has unique device
type: ObjectProperty
type: FunctionalProperty
domain: DeviceExposure
python name: unique_device
comment: (for DeviceExposure:) A UDI or equivalent identifying the instance of the Device used in the Person.
omop cdm name: device_exposure.unique_device_id#36 AS Thing

has drug exposure
type: ObjectProperty
domain: Class
  union of: BaseVisit
  union of: Person
range: DrugExposure
python name: drug_exposures
comment: (reversed relation, for DrugExposure:) A foreign key identifier to the Person who is subjected to the Drug. The demographic details of that Person are stored in the PERSON table.
comment: (reversed relation, for DrugExposure:) A foreign key to the Visit in the VISIT_OCCURRENCE table during which the Drug Exposure was initiated.
comment: (reversed relation, for DrugExposure:) A foreign key to the Visit Detail in the VISIT_DETAIL table during which the Drug Exposure was initiated.
omop cdm name: drug_exposure.person_id#44 AS Person
omop cdm name: drug_exposure.visit_occurrence_id#60 AS VisitOccurrence
omop cdm name: drug_exposure.visit_detail_id#61 AS VisitDetail

has route
type: ObjectProperty
type: FunctionalProperty
domain: DrugExposure
range: Concept
python name: route
comment: (for DrugExposure:) A foreign key that refers to a Standard Concept identifier in the Standardized Vocabularies reflecting the route of administration and belonging to the 'Route' domain.
omop cdm name: drug_exposure.route_concept_id#57 AS Concept

has relationship
type: ObjectProperty
type: FunctionalProperty
domain: Class
  union of: ConceptRelationship
  union of: FactRelationship
python name: relationship
comment: (for FactRelationship:) A foreign key to a Standard Concept ID of relationship in the Standardized Vocabularies.
comment: (for ConceptRelationship:) A unique identifier to the type or nature of the Relationship as defined in the [RELATIONSHIP](https://github.com/OHDSI/CommonDataModel/wiki/RELATIONSHIP) table.
omop cdm name: fact_relationship.relationship_concept_id#70 AS Concept
omop cdm name: concept_relationship.relationship_id#386 AS Relationship

has measurement
type: ObjectProperty
domain: Class
  union of: BaseVisit
  union of: Person
range: Measurement
python name: measurements
comment: (reversed relation, for Measurement:) A foreign key identifier to the Person about whom the measurement was recorded. The demographic details of that Person are stored in the PERSON table.
comment: (reversed relation, for Measurement:) A foreign key to the Visit in the VISIT_OCCURRENCE table during which the Measurement was recorded.
comment: (reversed relation, for Measurement:) A foreign key to the Visit Detail in the VISIT_DETAIL table during which the Measurement was recorded.
omop cdm name: measurement.person_id#72 AS Person
omop cdm name: measurement.visit_occurrence_id#85 AS VisitOccurrence
omop cdm name: measurement.visit_detail_id#86 AS VisitDetail

has operator
type: ObjectProperty
type: FunctionalProperty
domain: Measurement
range: Concept
python name: operator
comment: (for Measurement:) A foreign key identifier to the predefined Concept in the Standardized Vocabularies reflecting the mathematical operator that is applied to the value_as_number. Operators are <, <=, =, >=, > and these concepts belong to the 'Meas Value Operator' domain.
omop cdm name: measurement.operator_concept_id#78 AS Concept

has value as concept
type: ObjectProperty
type: FunctionalProperty
domain: Class
  union of: Measurement
  union of: Metadata
  union of: Observation
range: Concept
python name: value_as_concept
comment: (for Measurement:) A foreign key to a Measurement result represented as a Concept from the Standardized Vocabularies (e.g., positive/negative, present/absent, low/high, etc.). These belong to the 'Meas Value' domain
comment: (for Observation:) A foreign key to an observation result stored as a Concept ID. This is applicable to observations where the result can be expressed as a Standard Concept from the Standardized Vocabularies (e.g., positive/negative, present/absent, low/high, etc.).
comment: (for Metadata:) A foreign key to a metadata value stored as a Concept ID.
omop cdm name: measurement.value_as_concept_id#80 AS Concept
omop cdm name: observation.value_as_concept_id#129 AS Concept
omop cdm name: metadata.value_as_concept_id#364 AS Concept

has unit
type: ObjectProperty
type: FunctionalProperty
domain: Class
  union of: DoseEra
  union of: Measurement
  union of: Specimen
  union of: Observation
range: Concept
python name: unit
comment: (for Measurement:) A foreign key to a Standard Concept ID of Measurement Units in the Standardized Vocabularies that belong to the 'Unit' domain.
comment: (for Observation:) A foreign key to a Standard Concept ID of measurement units in the Standardized Vocabularies.
comment: (for Specimen:) A foreign key to a Standard Concept identifier for the Unit associated with the numeric quantity of the Specimen collection.
comment: (for DoseEra:) A foreign key that refers to a Standard Concept identifier in the Standardized Vocabularies for the unit concept.
omop cdm name: measurement.unit_concept_id#81 AS Concept
omop cdm name: observation.unit_concept_id#131 AS Concept
omop cdm name: specimen.unit_concept_id#187 AS Concept
omop cdm name: dose_era.unit_concept_id#264 AS Concept

has note
type: ObjectProperty
domain: Class
  union of: BaseVisit
  union of: Person
range: Note
python name: notes
comment: (reversed relation, for Note:) A foreign key identifier to the Person about whom the Note was recorded. The demographic details of that Person are stored in the PERSON table.
comment: (reversed relation, for Note:) A foreign key to the Visit in the VISIT_OCCURRENCE table when the Note was taken.
comment: (reversed relation, for Note:) A foreign key to the Visit in the VISIT_DETAIL table when the Note was taken.
omop cdm name: note.person_id#92 AS Person
omop cdm name: note.visit_occurrence_id#104 AS VisitOccurrence
omop cdm name: note.visit_detail_id#105 AS VisitDetail

has event
type: ObjectProperty
type: FunctionalProperty
domain: Class
  union of: Cost
  union of: Observation
  union of: Note
python name: event
comment: (for Note:) A foreign key identifier to the event (e.g. Measurement, Procedure, Visit, Drug Exposure, etc) record during which the note was recorded.
comment: (for Observation:) A foreign key to an event table (e.g., PROCEDURE_OCCURRENCE_ID).
comment: (for Cost:) A foreign key identifier to the event (e.g. Measurement, Procedure, Visit, Drug Exposure, etc) record for which cost data are recorded.
omop cdm name: note.note_event_id#93 AS Thing
omop cdm name: observation.observation_event_id#139 AS Thing
omop cdm name: cost.cost_event_id#277 AS Thing

has event field
type: ObjectProperty
type: FunctionalProperty
domain: Class
  union of: Cost
  union of: Note
range: Concept
python name: event_field
comment: (for Note:) A foreign key to the predefined Concept in the Standardized Vocabularies reflecting the field to which the note_event_id is referring.
comment: (for Cost:) A foreign key identifier to a concept in the CONCEPT table representing the identity of the field represented by COST_EVENT_ID
omop cdm name: note.note_event_field_concept_id#94 AS Concept
omop cdm name: cost.cost_event_field_concept_id#278 AS Concept

has class
type: ObjectProperty
type: FunctionalProperty
domain: Class
  union of: Concept
  union of: Note
python name: class
comment: (for Note:) A foreign key to the predefined Concept in the Standardized Vocabularies reflecting the HL7 LOINC Document Type Vocabulary classification of the note.
comment: (for Concept:) The attribute or concept class of the Concept. Examples are 'Clinical Drug', 'Ingredient', 'Clinical Finding' etc.
omop cdm name: note.note_class_concept_id#98 AS Concept
omop cdm name: concept.concept_class_id#371 AS ConceptClass

has encoding
type: ObjectProperty
type: FunctionalProperty
domain: Note
range: Concept
python name: encoding
comment: (for Note:) A foreign key to the predefined Concept in the Standardized Vocabularies reflecting the note character encoding type
omop cdm name: note.encoding_concept_id#101 AS Concept

has language
type: ObjectProperty
type: FunctionalProperty
domain: Class
  union of: ConceptSynonym
  union of: Note
range: Concept
python name: language
comment: (for Note:) A foreign key to the predefined Concept in the Standardized Vocabularies reflecting the language of the note
comment: (for ConceptSynonym:) A foreign key to a Concept representing the language.
omop cdm name: note.language_concept_id#102 AS Concept
omop cdm name: concept_synonym.language_concept_id#392 AS Concept

has note nlp
type: ObjectProperty
domain: Note
range: NoteNlp
python name: note_nlps
comment: (reversed relation, for NoteNlp:) A foreign key to the Note table note the term was
omop cdm name: note_nlp.note_id#108 AS Note

has section
type: ObjectProperty
type: FunctionalProperty
domain: NoteNlp
range: Concept
python name: section
comment: (for NoteNlp:) A foreign key to the predefined Concept in the Standardized Vocabularies representing the section of the extracted term.
omop cdm name: note_nlp.section_concept_id#109 AS Concept

has observation
type: ObjectProperty
domain: Class
  union of: BaseVisit
  union of: Person
range: Observation
python name: observations
comment: (reversed relation, for Observation:) A foreign key identifier to the Person about whom the observation was recorded. The demographic details of that Person are stored in the PERSON table.
comment: (reversed relation, for Observation:) A foreign key to the visit in the VISIT_OCCURRENCE table during which the observation was recorded.
comment: (reversed relation, for Observation:) A foreign key to the visit in the VISIT_DETAIL table during which the observation was recorded.
omop cdm name: observation.person_id#122 AS Person
omop cdm name: observation.visit_occurrence_id#133 AS VisitOccurrence
omop cdm name: observation.visit_detail_id#134 AS VisitDetail

has qualifier
type: ObjectProperty
type: FunctionalProperty
domain: Observation
range: Concept
python name: qualifier
comment: (for Observation:) A foreign key to a Standard Concept ID for a qualifier (e.g., severity of drug-drug interaction alert)
omop cdm name: observation.qualifier_concept_id#130 AS Concept

has obs event field
type: ObjectProperty
type: FunctionalProperty
domain: Observation
range: Concept
python name: obs_event_field
comment: (for Observation:) A foreign key that refers to a Standard Concept identifier in the Standardized Vocabularies referring to the field represented in the OBSERVATION_EVENT_ID.
omop cdm name: observation.obs_event_field_concept_id#140 AS Concept

has observation period
type: ObjectProperty
domain: Person
range: ObservationPeriod
python name: observation_periods
comment: (reversed relation, for ObservationPeriod:) A foreign key identifier to the person for whom the observation period is defined. The demographic details of that person are stored in the person table.
omop cdm name: observation_period.person_id#143 AS Person

has period type
type: ObjectProperty
type: FunctionalProperty
domain: ObservationPeriod
range: Concept
python name: period_type
comment: (for ObservationPeriod:) A foreign key identifier to the predefined concept in the Standardized Vocabularies reflecting the source of the observation period information, belonging to the 'Obs Period Type' vocabulary
omop cdm name: observation_period.period_type_concept_id#146 AS Concept

has gender
type: ObjectProperty
type: FunctionalProperty
domain: BasePerson
range: Concept
python name: gender
comment: (for Person:) A foreign key that refers to an identifier in the CONCEPT table for the unique gender of the person.
comment: (for Provider:) The gender of the Provider.
omop cdm name: person.gender_concept_id#148 AS Concept
omop cdm name: provider.gender_concept_id#344 AS Concept

has race
type: ObjectProperty
type: FunctionalProperty
domain: Person
range: Concept
python name: race
comment: (for Person:) A foreign key that refers to an identifier in the CONCEPT table for the unique race of the person, belonging to the 'Race' vocabulary.
omop cdm name: person.race_concept_id#154 AS Concept

has ethnicity
type: ObjectProperty
type: FunctionalProperty
domain: Person
range: Concept
python name: ethnicity
comment: (for Person:) A foreign key that refers to the standard concept identifier in the Standardized Vocabularies for the ethnicity of the person, belonging to the 'Ethnicity' vocabulary.
omop cdm name: person.ethnicity_concept_id#155 AS Concept

has location
type: ObjectProperty
type: FunctionalProperty
domain: Class
  union of: CareSite
  union of: LocationHistory
  union of: Person
range: Location
python name: location
comment: (for Person:) A foreign key to the place of residency for the person in the location table, where the detailed address information is stored.
comment: (for CareSite:) A foreign key to the geographic Location in the LOCATION table, where the detailed address information is stored.
comment: (for LocationHistory:) A foreign key to the location table.
omop cdm name: person.location_id#156 AS Location
omop cdm name: care_site.location_id#317 AS Location
omop cdm name: location_history.location_id#331 AS Location

has care site
type: ObjectProperty
type: FunctionalProperty
domain: Class
  union of: BasePerson
  union of: BaseVisit
range: CareSite
python name: care_site
comment: (for Person:) A foreign key to the site of primary care in the care_site table, where the details of the care site are stored.
comment: (for VisitDetail:) A foreign key to the care site in the care site table that was visited.
comment: (for VisitOccurrence:) A foreign key to the care site in the care site table that was visited.
comment: (for Provider:) A foreign key to the main Care Site where the provider is practicing.
omop cdm name: person.care_site_id#158 AS CareSite
omop cdm name: visit_detail.care_site_id#228 AS CareSite
omop cdm name: visit_occurrence.care_site_id#247 AS CareSite
omop cdm name: provider.care_site_id#342 AS CareSite

has gender source
type: ObjectProperty
type: FunctionalProperty
domain: BasePerson
range: Concept
python name: gender_source
comment: (for Person:) A foreign key to the gender concept that refers to the code used in the source.
comment: (for Provider:) A foreign key to a Concept that refers to the code used in the source.
omop cdm name: person.gender_source_concept_id#161 AS Concept
omop cdm name: provider.gender_source_concept_id#349 AS Concept

has race source
type: ObjectProperty
type: FunctionalProperty
domain: Person
range: Concept
python name: race_source
comment: (for Person:) A foreign key to the race concept that refers to the code used in the source.
omop cdm name: person.race_source_concept_id#163 AS Concept

has ethnicity source
type: ObjectProperty
type: FunctionalProperty
domain: Person
range: Concept
python name: ethnicity_source
comment: (for Person:) A foreign key to the ethnicity concept that refers to the code used in the source.
omop cdm name: person.ethnicity_source_concept_id#165 AS Concept

has procedure occurrence
type: ObjectProperty
domain: Class
  union of: BaseVisit
  union of: Person
range: ProcedureOccurrence
python name: procedure_occurrences
comment: (reversed relation, for ProcedureOccurrence:) A foreign key identifier to the Person who is subjected to the Procedure. The demographic details of that Person are stored in the PERSON table.
comment: (reversed relation, for ProcedureOccurrence:) A foreign key to the Visit in the VISIT_OCCURRENCE table during which the Procedure was carried out.
comment: (reversed relation, for ProcedureOccurrence:) A foreign key to the Visit Detail in the VISIT_DETAIL table during which the Procedure was carried out.
omop cdm name: procedure_occurrence.person_id#167 AS Person
omop cdm name: procedure_occurrence.visit_occurrence_id#175 AS VisitOccurrence
omop cdm name: procedure_occurrence.visit_detail_id#176 AS VisitDetail

has modifier
type: ObjectProperty
type: FunctionalProperty
domain: ProcedureOccurrence
range: Concept
python name: modifier
comment: (for ProcedureOccurrence:) A foreign key to a Standard Concept identifier for a modifier to the Procedure (e.g. bilateral). These concepts are typically distinguished by 'Modifier' concept classes (e.g., 'CPT4 Modifier' as part of the 'CPT4' vocabulary).
omop cdm name: procedure_occurrence.modifier_concept_id#172 AS Concept

has specimen
type: ObjectProperty
domain: Person
range: Specimen
python name: specimens
comment: (reversed relation, for Specimen:) A foreign key identifier to the Person for whom the Specimen is recorded.
omop cdm name: specimen.person_id#181 AS Person

has anatomic site
type: ObjectProperty
type: FunctionalProperty
domain: Specimen
range: Concept
python name: anatomic_site
comment: (for Specimen:) A foreign key to a Standard Concept identifier for the anatomic location of specimen collection.
omop cdm name: specimen.anatomic_site_concept_id#188 AS Concept

has disease status
type: ObjectProperty
type: FunctionalProperty
domain: Specimen
range: Concept
python name: disease_status
comment: (for Specimen:) A foreign key to a Standard Concept identifier for the Disease Status of specimen collection.
omop cdm name: specimen.disease_status_concept_id#189 AS Concept

has survey conduct
type: ObjectProperty
domain: Class
  union of: VisitOccurrence
  union of: Person
range: SurveyConduct
python name: survey_conducts
comment: (reversed relation, for SurveyConduct:) A foreign key identifier to the Person in the PERSON table about whom the survey was completed.
comment: (reversed relation, for SurveyConduct:) A foreign key to the VISIT_OCCURRENCE table during which the survey was completed
omop cdm name: survey_conduct.person_id#196 AS Person
omop cdm name: survey_conduct.visit_occurrence_id#217 AS VisitOccurrence

has survey
type: ObjectProperty
type: FunctionalProperty
domain: SurveyConduct
range: Concept
python name: survey
comment: (for SurveyConduct:) A foreign key to the predefined Concept identifier in the Standardized Vocabularies reflecting the name and identity of the survey.
omop cdm name: survey_conduct.survey_concept_id#197 AS Concept

has assisted
type: ObjectProperty
type: FunctionalProperty
domain: SurveyConduct
range: Concept
python name: assisted
comment: (for SurveyConduct:) A foreign key to the predefined Concept identifier in the Standardized Vocabularies indicating whether the survey was completed with assistance.
omop cdm name: survey_conduct.assisted_concept_id#203 AS Concept

has respondent type
type: ObjectProperty
type: FunctionalProperty
domain: SurveyConduct
range: Concept
python name: respondent_type
comment: (for SurveyConduct:) A foreign key to the predefined Concept identifier in the Standardized Vocabularies reflecting the respondent type. Example: Research Associate, Patient.
omop cdm name: survey_conduct.respondent_type_concept_id#204 AS Concept

has timing
type: ObjectProperty
type: FunctionalProperty
domain: SurveyConduct
range: Concept
python name: timing
comment: (for SurveyConduct:) A foreign key to the predefined Concept identifier in the Standardized Vocabularies that refers to a certain timing. Example: 3 month follow-up, 6 month follow-up.
omop cdm name: survey_conduct.timing_concept_id#205 AS Concept

has collection method
type: ObjectProperty
type: FunctionalProperty
domain: SurveyConduct
range: Concept
python name: collection_method
comment: (for SurveyConduct:) A foreign key to the predefined Concept identifier in the Standardized Vocabularies reflecting the data collection method (e.g. Paper, Telephone, Electronic Questionnaire).
omop cdm name: survey_conduct.collection_method_concept_id#206 AS Concept

has survey source
type: ObjectProperty
type: FunctionalProperty
domain: SurveyConduct
range: Concept
python name: survey_source
comment: (for SurveyConduct:) A foreign key to a predefined Concept that refers to the code for the survey name/title used in the source.
omop cdm name: survey_conduct.survey_source_concept_id#212 AS Concept

has validated survey
type: ObjectProperty
type: FunctionalProperty
domain: SurveyConduct
range: Concept
python name: validated_survey
comment: (for SurveyConduct:) A foreign key to the predefined Concept identifier in the Standardized Vocabularies reflecting the validation status of the survey.
omop cdm name: survey_conduct.validated_survey_concept_id#214 AS Concept

has response visit occurrence
type: ObjectProperty
type: FunctionalProperty
domain: SurveyConduct
range: VisitOccurrence
python name: response_visit_occurrence
comment: (for SurveyConduct:) A foreign key to the visit in the VISIT_OCCURRENCE table during which treatment was carried out that relates to this survey.
omop cdm name: survey_conduct.response_visit_occurrence_id#218 AS VisitOccurrence

has visit detail
type: ObjectProperty
domain: Class
  union of: VisitOccurrence
  union of: Person
range: VisitDetail
python name: visit_details
comment: (reversed relation, for VisitDetail:) A foreign key identifier to the Person for whom the visit is recorded. The demographic details of that Person are stored in the PERSON table.
comment: (reversed relation, for VisitDetail:) A foreign key that refers to the record in the VISIT_OCCURRENCE table. This is a required field, because for every visit_detail is a child of visit_occurrence and cannot exist without a corresponding parent record in visit_occurrence.
omop cdm name: visit_detail.person_id#220 AS Person
omop cdm name: visit_detail.visit_occurrence_id#237 AS VisitOccurrence

has admitted from
type: ObjectProperty
type: FunctionalProperty
domain: VisitDetail
range: Concept
python name: admitted_from
comment: (for VisitDetail:) A foreign key to the predefined concept in the 'Place of Service' Vocabulary reflecting the admitting source for a visit.
omop cdm name: visit_detail.admitted_from_concept_id#232 AS Concept

has discharge to
type: ObjectProperty
type: FunctionalProperty
domain: BaseVisit
range: Concept
python name: discharge_to
comment: (for VisitDetail:) A foreign key to the predefined concept in the 'Place of Service' Vocabulary reflecting the discharge disposition for a visit.
comment: (for VisitOccurrence:) A foreign key to the predefined concept in the Place of Service Vocabulary reflecting the discharge disposition for a visit.
omop cdm name: visit_detail.discharge_to_concept_id#234 AS Concept
omop cdm name: visit_occurrence.discharge_to_concept_id#252 AS Concept

has preceding visit detail
type: ObjectProperty
type: FunctionalProperty
domain: VisitDetail
range: VisitDetail
python name: preceding_visit_detail
comment: (for VisitDetail:) A foreign key to the VISIT_DETAIL table of the visit immediately preceding this visit
omop cdm name: visit_detail.preceding_visit_detail_id#235 AS VisitDetail

has parent
type: ObjectProperty
type: FunctionalProperty
domain: VisitDetail
range: VisitDetail
python name: parent
comment: (for VisitDetail:) A foreign key to the VISIT_DETAIL table record to represent the immediate parent visit-detail record.
omop cdm name: visit_detail.visit_detail_parent_id#236 AS VisitDetail

has visit occurrence
type: ObjectProperty
domain: Person
range: VisitOccurrence
python name: visit_occurrences
comment: (reversed relation, for VisitOccurrence:) A foreign key identifier to the Person for whom the visit is recorded. The demographic details of that Person are stored in the PERSON table.
omop cdm name: visit_occurrence.person_id#239 AS Person

has admitting source
type: ObjectProperty
type: FunctionalProperty
domain: VisitOccurrence
range: Concept
python name: admitting_source
comment: (for VisitOccurrence:) A foreign key to the predefined concept in the Place of Service Vocabulary reflecting the admitting source for a visit.
omop cdm name: visit_occurrence.admitting_source_concept_id#250 AS Concept

has preceding visit occurrence
type: ObjectProperty
type: FunctionalProperty
domain: VisitOccurrence
range: VisitOccurrence
python name: preceding_visit_occurrence
comment: (for VisitOccurrence:) A foreign key to the VISIT_OCCURRENCE table of the visit immediately preceding this visit
omop cdm name: visit_occurrence.preceding_visit_occurrence_id#254 AS VisitOccurrence

has condition era
type: ObjectProperty
domain: Person
range: ConditionEra
python name: condition_eras
comment: (reversed relation, for ConditionEra:) A foreign key identifier to the Person who is experiencing the Condition during the Condition Era. The demographic details of that Person are stored in the PERSON table.
omop cdm name: condition_era.person_id#256 AS Person

has dose era
type: ObjectProperty
domain: Person
range: DoseEra
python name: dose_eras
comment: (reversed relation, for DoseEra:) A foreign key identifier to the Person who is subjected to the drug during the drug era. The demographic details of that Person are stored in the PERSON table.
omop cdm name: dose_era.person_id#262 AS Person

has drug era
type: ObjectProperty
domain: Person
range: DrugEra
python name: drug_eras
comment: (reversed relation, for DrugEra:) A foreign key identifier to the Person who is subjected to the Drug during the fDrug Era. The demographic details of that Person are stored in the PERSON table.
omop cdm name: drug_era.person_id#269 AS Person

has cost
type: ObjectProperty
domain: Person
range: Cost
python name: costs
comment: (reversed relation, for Cost:) A unique identifier for each PERSON.
omop cdm name: cost.person_id#276 AS Person

has currency
type: ObjectProperty
type: FunctionalProperty
domain: Cost
range: Concept
python name: currency
comment: (for Cost:) A foreign key identifier to the concept representing the 3-letter code used to delineate international currencies, such as USD for US Dollar. These belong to the 'Currency' vocabulary
omop cdm name: cost.currency_concept_id#283 AS Concept

has revenue code
type: ObjectProperty
type: FunctionalProperty
domain: Cost
range: Concept
python name: revenue_code
comment: (for Cost:) A foreign key referring to a Standard Concept ID in the Standardized Vocabularies for Revenue codes belonging to the 'Revenue Code' vocabulary.
omop cdm name: cost.revenue_code_concept_id#288 AS Concept

has drg
type: ObjectProperty
type: FunctionalProperty
domain: Cost
range: Concept
python name: drg
comment: (for Cost:) A foreign key referring to a Standard Concept ID in the Standardized Vocabularies for DRG codes belonging to the 'DRG' vocabulary.
omop cdm name: cost.drg_concept_id#289 AS Concept

has payer plan period
type: ObjectProperty
type: FunctionalProperty
domain: Class
  union of: Cost
  union of: Person
range: PayerPlanPeriod
python name: payer_plan_periods
comment: (for Cost:) A foreign key to the PAYER_PLAN_PERIOD table, where the details of the Payer, Plan and Family are stored. Record the payer_plan_id that relates to the payer who contributed to the paid_by_payer field.
comment: (reversed relation, for PayerPlanPeriod:) A foreign key identifier to the Person covered by the payer. The demographic details of that Person are stored in the PERSON table.
omop cdm name: cost.payer_plan_period_id#292 AS PayerPlanPeriod
omop cdm name: payer_plan_period.person_id#294 AS Person

has contract person
type: ObjectProperty
type: FunctionalProperty
domain: PayerPlanPeriod
range: Person
python name: contract_person
comment: (for PayerPlanPeriod:) A foreign key identifier to the person_id in person table, for the person who is the primary subscriber/contract owner for the record in the payer_plan_period table. Maybe the same person or different person, depending on who is the primary subscriber/contract owner.
omop cdm name: payer_plan_period.contract_person_id#295 AS Person

has payer
type: ObjectProperty
type: FunctionalProperty
domain: PayerPlanPeriod
range: Concept
python name: payer
comment: (for PayerPlanPeriod:) A foreign key that refers to a standard Payer concept identifier in the Standarized Vocabularies
omop cdm name: payer_plan_period.payer_concept_id#298 AS Concept

has payer source
type: ObjectProperty
type: FunctionalProperty
domain: PayerPlanPeriod
range: Concept
python name: payer_source
comment: (for PayerPlanPeriod:) A foreign key to a payer concept that refers to the code used in the source.
omop cdm name: payer_plan_period.payer_source_concept_id#300 AS Concept

has plan
type: ObjectProperty
type: FunctionalProperty
domain: PayerPlanPeriod
range: Concept
python name: plan
comment: (for PayerPlanPeriod:) A foreign key that refers to a standard plan concept identifier that represents the health benefit plan in the Standardized Vocabularies.
omop cdm name: payer_plan_period.plan_concept_id#301 AS Concept

has plan source
type: ObjectProperty
type: FunctionalProperty
domain: PayerPlanPeriod
range: Concept
python name: plan_source
comment: (for PayerPlanPeriod:) A foreign key to a plan concept that refers to the plan code used in the source data.
omop cdm name: payer_plan_period.plan_source_concept_id#303 AS Concept

has contract
type: ObjectProperty
type: FunctionalProperty
domain: PayerPlanPeriod
range: Concept
python name: contract
comment: (for PayerPlanPeriod:) A foreign key to a standard concept representing the reason justifying the contract between person_id and contract_person_id.
omop cdm name: payer_plan_period.contract_concept_id#304 AS Concept

has contract source
type: ObjectProperty
type: FunctionalProperty
domain: PayerPlanPeriod
range: Concept
python name: contract_source
comment: (for PayerPlanPeriod:) A foreign key to a concept that refers to the code used in the source as the reason justifying the contract.
omop cdm name: payer_plan_period.contract_source_concept_id#306 AS Concept

has sponsor
type: ObjectProperty
type: FunctionalProperty
domain: PayerPlanPeriod
range: Concept
python name: sponsor
comment: (for PayerPlanPeriod:) A foreign key that refers to a concept identifier that represents the sponsor in the Standardized Vocabularies.
omop cdm name: payer_plan_period.sponsor_concept_id#307 AS Concept

has sponsor source
type: ObjectProperty
type: FunctionalProperty
domain: PayerPlanPeriod
range: Concept
python name: sponsor_source
comment: (for PayerPlanPeriod:) A foreign key to a sponsor concept that refers to the sponsor code used in the source data.
omop cdm name: payer_plan_period.sponsor_source_concept_id#309 AS Concept

has stop reason concept
type: ObjectProperty
type: FunctionalProperty
domain: PayerPlanPeriod
range: Concept
python name: stop_reason_concept
comment: (for PayerPlanPeriod:) A foreign key that refers to a standard termination reason that represents the reason for the termination in the Standardized Vocabularies.
omop cdm name: payer_plan_period.stop_reason_concept_id#311 AS Concept

has stop reason source
type: ObjectProperty
type: FunctionalProperty
domain: PayerPlanPeriod
range: Concept
python name: stop_reason_source
comment: (for PayerPlanPeriod:) A foreign key to a stop-coverage concept that refers to the code used in the source.
omop cdm name: payer_plan_period.stop_reason_source_concept_id#313 AS Concept

has place of service
type: ObjectProperty
type: FunctionalProperty
domain: CareSite
range: Concept
python name: place_of_service
comment: (for CareSite:) A foreign key that refers to a Place of Service Concept ID in the Standardized Vocabularies.
omop cdm name: care_site.place_of_service_concept_id#316 AS Concept

has relationship type
type: ObjectProperty
type: FunctionalProperty
domain: LocationHistory
range: Concept
python name: relationship_type
comment: (for LocationHistory:) The type of relationship between location and entity.
omop cdm name: location_history.relationship_type_concept_id#332 AS Concept

has domain
type: ObjectProperty
type: FunctionalProperty
domain: Class
  union of: LocationHistory
  union of: Concept
range: Domain
python name: domain
comment: (for LocationHistory:) The domain of the entity that is related to the location. Either PERSON, PROVIDER, or CARE_SITE.
comment: (for Concept:) A foreign key to the [DOMAIN](https://github.com/OHDSI/CommonDataModel/wiki/DOMAIN) table the Concept belongs to.
omop cdm name: location_history.domain_id#333 AS Domain
omop cdm name: concept.domain_id#369 AS Domain

has entity
type: ObjectProperty
type: FunctionalProperty
domain: LocationHistory
python name: entity
comment: (for LocationHistory:) The unique identifier for the entity. References either person_id, provider_id, or care_site_id, depending on domain_id.
omop cdm name: location_history.entity_id#334 AS Thing

has specialty
type: ObjectProperty
type: FunctionalProperty
domain: Provider
range: Concept
python name: specialty
comment: (for Provider:) A foreign key to a Standard Specialty Concept ID in the Standardized Vocabularies.
omop cdm name: provider.specialty_concept_id#341 AS Concept

has specialty source
type: ObjectProperty
type: FunctionalProperty
domain: Provider
range: Concept
python name: specialty_source
comment: (for Provider:) A foreign key to a Concept that refers to the code used in the source.
omop cdm name: provider.specialty_source_concept_id#347 AS Concept

has vocabulary
type: ObjectProperty
type: FunctionalProperty
domain: Concept
range: Vocabulary
python name: vocabulary
comment: (for Concept:) A foreign key to the [VOCABULARY](https://github.com/OHDSI/CommonDataModel/wiki/VOCABULARY) table indicating from which source the Concept has been adapted.
omop cdm name: concept.vocabulary_id#370 AS Vocabulary

has ancestor
type: ObjectProperty
type: FunctionalProperty
domain: ConceptAncestor
range: Concept
python name: ancestor
comment: (for ConceptAncestor:) A foreign key to the concept in the concept table for the higher-level concept that forms the ancestor in the relationship.
omop cdm name: concept_ancestor.ancestor_concept_id#377 AS Concept

has descendant
type: ObjectProperty
type: FunctionalProperty
domain: ConceptAncestor
range: Concept
python name: descendant
comment: (for ConceptAncestor:) A foreign key to the concept in the concept table for the lower-level concept that forms the descendant in the relationship.
omop cdm name: concept_ancestor.descendant_concept_id#378 AS Concept

has ingredient
type: ObjectProperty
type: FunctionalProperty
domain: DrugStrength
range: Concept
python name: ingredient
comment: (for DrugStrength:) A foreign key to the Concept in the CONCEPT table, representing the identifier for drug Ingredient Concept contained within the drug product.
omop cdm name: drug_strength.ingredient_concept_id#397 AS Concept

has amount unit
type: ObjectProperty
type: FunctionalProperty
domain: DrugStrength
range: Concept
python name: amount_unit
comment: (for DrugStrength:) A foreign key to the Concept in the CONCEPT table representing the identifier for the Unit for the absolute amount of active ingredient.
omop cdm name: drug_strength.amount_unit_concept_id#399 AS Concept

has numerator unit
type: ObjectProperty
type: FunctionalProperty
domain: DrugStrength
range: Concept
python name: numerator_unit
comment: (for DrugStrength:) A foreign key to the Concept in the CONCEPT table representing the identifier for the numerator Unit for the concentration of active ingredient.
omop cdm name: drug_strength.numerator_unit_concept_id#401 AS Concept

has denominator unit
type: ObjectProperty
type: FunctionalProperty
domain: DrugStrength
range: Concept
python name: denominator_unit
comment: (for DrugStrength:) A foreign key to the Concept in the CONCEPT table representing the identifier for the denominator Unit for the concentration of active ingredient.
omop cdm name: drug_strength.denominator_unit_concept_id#403 AS Concept

has reverse relationship
type: ObjectProperty
type: FunctionalProperty
domain: Relationship
python name: reverse_relationship
comment: (for Relationship:) The identifier for the relationship used to define the reverse relationship between two concepts.
omop cdm name: relationship.reverse_relationship_id#412 AS Thing

has source vocabulary
type: ObjectProperty
type: FunctionalProperty
domain: SourceToConceptMap
range: Vocabulary
python name: source_vocabulary
comment: (for SourceToConceptMap:) A foreign key to the VOCABULARY table defining the vocabulary of the source code that is being translated to a Standard Concept.
omop cdm name: source_to_concept_map.source_vocabulary_id#416 AS Vocabulary

has target
type: ObjectProperty
type: FunctionalProperty
domain: SourceToConceptMap
range: Concept
python name: target
comment: (for SourceToConceptMap:) A foreign key to the target Concept to which the source code is being mapped.
omop cdm name: source_to_concept_map.target_concept_id#418 AS Concept

has target vocabulary
type: ObjectProperty
type: FunctionalProperty
domain: SourceToConceptMap
range: Vocabulary
python name: target_vocabulary
comment: (for SourceToConceptMap:) A foreign key to the VOCABULARY table defining the vocabulary of the target Concept.
omop cdm name: source_to_concept_map.target_vocabulary_id#419 AS Vocabulary

start date
type: DatatypeProperty
type: FunctionalProperty
domain: DateDuration
range: date
comment: (for Cohort:) The date when the Cohort Definition criteria for the Person, Provider or Visit first match.
comment: (for ConditionOccurrence:) The date when the instance of the Condition is recorded.
comment: (for DeviceExposure:) The date the Device or supply was applied or used.
comment: (for DrugExposure:) The start date for the current instance of Drug utilization. Valid entries include a start date of a prescription, the date a prescription was filled, or the date on which a Drug administration procedure was recorded.
comment: (for ObservationPeriod:) The start date of the observation period for which data are available from the data source.
comment: (for VisitDetail:) The start date of the visit.
comment: (for VisitOccurrence:) The start date of the visit.
comment: (for PayerPlanPeriod:) The start date of the payer plan period.
comment: (for LocationHistory:) The date the relationship started.
omop cdm name: cohort.cohort_start_date#3 AS date
omop cdm name: condition_occurrence.condition_start_date#15 AS date
omop cdm name: device_exposure.device_exposure_start_date#31 AS date
omop cdm name: drug_exposure.drug_exposure_start_date#46 AS date
omop cdm name: observation_period.observation_period_start_date#144 AS date
omop cdm name: visit_detail.visit_detail_start_date#222 AS date
omop cdm name: visit_occurrence.visit_start_date#241 AS date
omop cdm name: payer_plan_period.payer_plan_period_start_date#296 AS date
omop cdm name: location_history.start_date#335 AS date

end date
type: DatatypeProperty
type: FunctionalProperty
domain: DateDuration
range: date
comment: (for Cohort:) The date when the Cohort Definition criteria for the Person, Provider or Visit no longer match or the Cohort membership was terminated.
comment: (for ConditionOccurrence:) The date when the instance of the Condition is considered to have ended.
comment: (for DeviceExposure:) The date use of the Device or supply was ceased.
comment: (for DrugExposure:) The end date for the current instance of Drug utilization. Depending on different sources, it could be a known or an inferred date and denotes the last day at which the patient was still exposed to Drug.
comment: (for ObservationPeriod:) The end date of the observation period for which data are available from the data source.
comment: (for VisitDetail:) The end date of the visit. If this is a one-day visit the end date should match the start date.
comment: (for VisitOccurrence:) The end date of the visit. If this is a one-day visit the end date should match the start date.
comment: (for PayerPlanPeriod:) The end date of the payer plan period.
comment: (for LocationHistory:) The date the relationship ended.
omop cdm name: cohort.cohort_end_date#4 AS date
omop cdm name: condition_occurrence.condition_end_date#17 AS date
omop cdm name: device_exposure.device_exposure_end_date#33 AS date
omop cdm name: drug_exposure.drug_exposure_end_date#48 AS date
omop cdm name: observation_period.observation_period_end_date#145 AS date
omop cdm name: visit_detail.visit_detail_end_date#224 AS date
omop cdm name: visit_occurrence.visit_end_date#243 AS date
omop cdm name: payer_plan_period.payer_plan_period_end_date#297 AS date
omop cdm name: location_history.end_date#336 AS date

id
type: DatatypeProperty
type: FunctionalProperty
domain: OmopCDMThing
range: Datatype
  union of: integer
  union of: string
comment: (for CohortDefinition:) A unique identifier for each Cohort.
comment: (for ConditionOccurrence:) A unique identifier for each Condition Occurrence event.
comment: (for DeviceExposure:) A system-generated unique identifier for each Device Exposure.
comment: (for DrugExposure:) A system-generated unique identifier for each Drug utilization event.
comment: (for Measurement:) A unique identifier for each Measurement.
comment: (for Note:) A unique identifier for each note.
comment: (for NoteNlp:) A unique identifier for each term extracted from a note.
comment: (for Observation:) A unique identifier for each observation.
comment: (for ObservationPeriod:) A unique identifier for each observation period.
comment: (for Person:) A unique identifier for each person.
comment: (for ProcedureOccurrence:) A system-generated unique identifier for each Procedure Occurrence.
comment: (for Specimen:) A unique identifier for each specimen.
comment: (for SurveyConduct:) Unique identifier for each completed survey.
comment: (for VisitDetail:) A unique identifier for each Person's visit or encounter at a healthcare provider.
comment: (for VisitOccurrence:) A unique identifier for each Person's visit or encounter at a healthcare provider.
comment: (for ConditionEra:) A unique identifier for each Condition Era.
comment: (for DoseEra:) A unique identifier for each Dose Era.
comment: (for DrugEra:) A unique identifier for each Drug Era.
comment: (for Cost:) A unique identifier for each COST record.
comment: (for PayerPlanPeriod:) A identifier for each unique combination of payer, plan, family code and time span.
comment: (for CareSite:) A unique identifier for each Care Site.
comment: (for Location:) A unique identifier for each geographic location.
comment: (for Provider:) A unique identifier for each Provider.
comment: (for Concept:) A unique identifier for each Concept across all domains.
comment: (for ConceptClass:) A unique key for each class.
comment: (for Domain:) A unique key for each domain.
comment: (for Relationship:) The type of relationship captured by the relationship record.
comment: (for Vocabulary:) A unique identifier for each Vocabulary, such as ICD9CM, SNOMED, Visit.
omop cdm name: cohort_definition.cohort_definition_id#5 AS int|str
omop cdm name: condition_occurrence.condition_occurrence_id#12 AS int|str
omop cdm name: device_exposure.device_exposure_id#28 AS int|str
omop cdm name: drug_exposure.drug_exposure_id#43 AS int|str
omop cdm name: measurement.measurement_id#71 AS int|str
omop cdm name: note.note_id#91 AS int|str
omop cdm name: note_nlp.note_nlp_id#107 AS int|str
omop cdm name: observation.observation_id#121 AS int|str
omop cdm name: observation_period.observation_period_id#142 AS int|str
omop cdm name: person.person_id#147 AS int|str
omop cdm name: procedure_occurrence.procedure_occurrence_id#166 AS int|str
omop cdm name: specimen.specimen_id#180 AS int|str
omop cdm name: survey_conduct.survey_conduct_id#195 AS int|str
omop cdm name: visit_detail.visit_detail_id#219 AS int|str
omop cdm name: visit_occurrence.visit_occurrence_id#238 AS int|str
omop cdm name: condition_era.condition_era_id#255 AS int|str
omop cdm name: dose_era.dose_era_id#261 AS int|str
omop cdm name: drug_era.drug_era_id#268 AS int|str
omop cdm name: cost.cost_id#275 AS int|str
omop cdm name: payer_plan_period.payer_plan_period_id#293 AS int|str
omop cdm name: care_site.care_site_id#314 AS int|str
omop cdm name: location.location_id#320 AS int|str
omop cdm name: provider.provider_id#337 AS int|str
omop cdm name: concept.concept_id#367 AS int|str
omop cdm name: concept_class.concept_class_id#381 AS int|str
omop cdm name: domain.domain_id#393 AS int|str
omop cdm name: relationship.relationship_id#408 AS int|str
omop cdm name: vocabulary.vocabulary_id#423 AS int|str

name
type: DatatypeProperty
type: FunctionalProperty
domain: Class
  union of: ConceptSynonym
  union of: Domain
  union of: Vocabulary
  union of: CohortDefinition
  union of: CareSite
  union of: Metadata
  union of: Provider
  union of: CdmSource
  union of: ConceptClass
  union of: Relationship
  union of: Concept
range: string
comment: (for CohortDefinition:) A short description of the Cohort.
comment: (for CareSite:) The verbatim description or name of the Care Site as in data source
comment: (for Provider:) A description of the Provider.
comment: (for CdmSource:) The full name of the source
comment: (for Metadata:) The name of the Concept stored in metadata_concept_id or a description of the data being stored.
comment: (for Concept:) An unambiguous, meaningful and descriptive name for the Concept.
comment: (for ConceptClass:) The name describing the Concept Class, e.g. "Clinical Finding", "Ingredient", etc.
comment: (for ConceptSynonym:) The alternative name for the Concept.
comment: (for Domain:) The name describing the Domain, e.g. "Condition", "Procedure", "Measurement" etc.
comment: (for Relationship:) The text that describes the relationship type.
comment: (for Vocabulary:) The name describing the vocabulary, for example "International Classification of Diseases, Ninth Revision, Clinical Modification, Volume 1 and 2 (NCHS)" etc.
omop cdm name: cohort_definition.cohort_definition_name#6 AS str
omop cdm name: care_site.care_site_name#315 AS str
omop cdm name: provider.provider_name#338 AS str
omop cdm name: cdm_source.cdm_source_name#350 AS str
omop cdm name: metadata.name#362 AS str
omop cdm name: concept.concept_name#368 AS str
omop cdm name: concept_class.concept_class_name#382 AS str
omop cdm name: concept_synonym.concept_synonym_name#391 AS str
omop cdm name: domain.domain_name#394 AS str
omop cdm name: relationship.relationship_name#409 AS str
omop cdm name: vocabulary.vocabulary_name#424 AS str

description
type: DatatypeProperty
type: FunctionalProperty
domain: CohortDefinition
range: string
comment: (for CohortDefinition:) A complete description of the Cohort definition
omop cdm name: cohort_definition.cohort_definition_description#7 AS str

syntax
type: DatatypeProperty
type: FunctionalProperty
domain: CohortDefinition
range: string
comment: (for CohortDefinition:) Syntax or code to operationalize the Cohort definition
omop cdm name: cohort_definition.cohort_definition_syntax#9 AS str

cohort initiation date
type: DatatypeProperty
type: FunctionalProperty
domain: CohortDefinition
range: date
comment: (for CohortDefinition:) A date to indicate when the Cohort was initiated in the COHORT table
omop cdm name: cohort_definition.cohort_initiation_date#11 AS date

start datetime
type: DatatypeProperty
type: FunctionalProperty
domain: DatetimeDuration
range: dateTime
comment: (for ConditionOccurrence:) The date and time when the instance of the Condition is recorded.
comment: (for DeviceExposure:) The date and time the Device or supply was applied or used.
comment: (for DrugExposure:) The start date and time for the current instance of Drug utilization. Valid entries include a start datetime of a prescription, the date and time a prescription was filled, or the date and time on which a Drug administration procedure was recorded.
comment: (for VisitDetail:) The date and time of the visit started.
comment: (for VisitOccurrence:) The date and time of the visit started.
comment: (for ConditionEra:) The start date for the Condition Era constructed from the individual instances of Condition Occurrences. It is the start date of the very first chronologically recorded instance of the condition.
comment: (for DoseEra:) The start date for the drug era constructed from the individual instances of drug exposures. It is the start date of the very first chronologically recorded instance of utilization of a drug.
comment: (for DrugEra:) The start date for the Drug Era constructed from the individual instances of Drug Exposures. It is the start date of the very first chronologically recorded instance of conutilization of a Drug.
omop cdm name: condition_occurrence.condition_start_datetime#16 AS datetime
omop cdm name: device_exposure.device_exposure_start_datetime#32 AS datetime
omop cdm name: drug_exposure.drug_exposure_start_datetime#47 AS datetime
omop cdm name: visit_detail.visit_detail_start_datetime#223 AS datetime
omop cdm name: visit_occurrence.visit_start_datetime#242 AS datetime
omop cdm name: condition_era.condition_era_start_datetime#258 AS date
omop cdm name: dose_era.dose_era_start_datetime#266 AS date
omop cdm name: drug_era.drug_era_start_datetime#271 AS date

end datetime
type: DatatypeProperty
type: FunctionalProperty
domain: DatetimeDuration
range: dateTime
comment: (for ConditionOccurrence:) The date when the instance of the Condition is considered to have ended.
comment: (for DeviceExposure:) The date and time use of the Device or supply was ceased.
comment: (for DrugExposure:) The end date and time for the current instance of Drug utilization. Depending on different sources, it could be a known or an inferred date and time and denotes the last day at which the patient was still exposed to Drug.
comment: (for VisitDetail:) The date and time of the visit end.
comment: (for VisitOccurrence:) The date and time of the visit end.
comment: (for ConditionEra:) The end date for the Condition Era constructed from the individual instances of Condition Occurrences. It is the end date of the final continuously recorded instance of the Condition.
comment: (for DoseEra:) The end date for the drug era constructed from the individual instance of drug exposures. It is the end date of the final continuously recorded instance of utilization of a drug.
comment: (for DrugEra:) The end date for the drug era constructed from the individual instance of drug exposures. It is the end date of the final continuously recorded instance of utilization of a drug.
omop cdm name: condition_occurrence.condition_end_datetime#18 AS datetime
omop cdm name: device_exposure.device_exposure_end_datetime#34 AS datetime
omop cdm name: drug_exposure.drug_exposure_end_datetime#49 AS datetime
omop cdm name: visit_detail.visit_detail_end_datetime#225 AS datetime
omop cdm name: visit_occurrence.visit_end_datetime#244 AS datetime
omop cdm name: condition_era.condition_era_end_datetime#259 AS date
omop cdm name: dose_era.dose_era_end_datetime#267 AS date
omop cdm name: drug_era.drug_era_end_datetime#272 AS date

stop reason
type: DatatypeProperty
type: FunctionalProperty
domain: Class
  union of: DrugExposure
  union of: ConditionOccurrence
range: string
comment: (for ConditionOccurrence:) The reason that the Condition was no longer present, as indicated in the source data.
comment: (for DrugExposure:) The reason the Drug was stopped. Reasons include regimen completed, changed, removed, etc.
omop cdm name: condition_occurrence.stop_reason#21 AS str
omop cdm name: drug_exposure.stop_reason#52 AS str

source value
type: DatatypeProperty
type: FunctionalProperty
domain: Class
  union of: BasePerson
  union of: Measurement
  union of: Specimen
  union of: Exposure
  union of: ConditionOccurrence
  union of: Observation
  union of: ProcedureOccurrence
  union of: CareSite
  union of: Note
  union of: BaseVisit
  union of: Cost
  union of: Location
range: string
comment: (for ConditionOccurrence:) The source code for the Condition as it appears in the source data. This code is mapped to a Standard Condition Concept in the Standardized Vocabularies and the original code is stored here for reference.
comment: (for DeviceExposure:) The source code for the Device as it appears in the source data. This code is mapped to a Standard Device Concept in the Standardized Vocabularies and the original code is stored here for reference.
comment: (for DrugExposure:) The source code for the Drug as it appears in the source data. This code is mapped to a Standard Drug concept in the Standardized Vocabularies and the original code is, stored here for reference.
comment: (for Measurement:) The Measurement name as it appears in the source data. This code is mapped to a Standard Concept in the Standardized Vocabularies and the original code is stored here for reference.
comment: (for Note:) The source value associated with the origin of the Note
comment: (for Observation:) The observation code as it appears in the source data. This code is mapped to a Standard Concept in the Standardized Vocabularies and the original code is, stored here for reference.
comment: (for Person:) An (encrypted) key derived from the person identifier in the source data. This is necessary when a use case requires a link back to the person data at the source dataset.
comment: (for ProcedureOccurrence:) The source code for the Procedure as it appears in the source data. This code is mapped to a standard procedure Concept in the Standardized Vocabularies and the original code is, stored here for reference. Procedure source codes are typically ICD-9-Proc, CPT-4, HCPCS or OPCS-4 codes.
comment: (for Specimen:) The Specimen value as it appears in the source data. This value is mapped to a Standard Concept in the Standardized Vocabularies and the original code is, stored here for reference.
comment: (for VisitDetail:) The source code for the visit as it appears in the source data.
comment: (for VisitOccurrence:) The source code for the visit as it appears in the source data.
comment: (for Cost:) The source value for the cost as it appears in the source data
comment: (for CareSite:) The identifier for the Care Site in the source data, stored here for reference.
comment: (for Location:) The verbatim information that is used to uniquely identify the location as it appears in the source data.
comment: (for Provider:) The identifier used for the Provider in the source data, stored here for reference.
omop cdm name: condition_occurrence.condition_source_value#25 AS str
omop cdm name: device_exposure.device_source_value#41 AS str
omop cdm name: drug_exposure.drug_source_value#62 AS str
omop cdm name: measurement.measurement_source_value#87 AS str
omop cdm name: note.note_source_value#106 AS str
omop cdm name: observation.observation_source_value#135 AS str
omop cdm name: person.person_source_value#159 AS str
omop cdm name: procedure_occurrence.procedure_source_value#177 AS str
omop cdm name: specimen.specimen_source_value#191 AS str
omop cdm name: visit_detail.visit_detail_source_value#229 AS str
omop cdm name: visit_occurrence.visit_source_value#248 AS str
omop cdm name: cost.cost_source_value#282 AS str
omop cdm name: care_site.care_site_source_value#318 AS str
omop cdm name: location.location_source_value#328 AS str
omop cdm name: provider.provider_source_value#345 AS str

status source value
type: DatatypeProperty
type: FunctionalProperty
domain: ConditionOccurrence
range: string
comment: (for ConditionOccurrence:) The source code for the condition status as it appears in the source data. This code is mapped to a Standard Concept in the Standardized Vocabularies and the original code is stored here for reference.
omop cdm name: condition_occurrence.condition_status_source_value#27 AS str

quantity
type: DatatypeProperty
type: FunctionalProperty
domain: Class
  union of: ProcedureOccurrence
  union of: DeviceExposure
  union of: Specimen
  union of: DrugExposure
comment: (for DeviceExposure:) The number of individual Devices used in the exposure.
comment: (for DrugExposure:) The quantity of drug as recorded in the original prescription or dispensing record.
comment: (for ProcedureOccurrence:) The quantity of procedures ordered or administered.
comment: (for Specimen:) The amount of specimen collection from the person during the sampling procedure.
omop cdm name: device_exposure.quantity#37 AS int
omop cdm name: drug_exposure.quantity#54 AS float
omop cdm name: procedure_occurrence.quantity#173 AS int
omop cdm name: specimen.quantity#186 AS float

verbatim end date
type: DatatypeProperty
type: FunctionalProperty
domain: DrugExposure
range: date
comment: (for DrugExposure:) The known end date of a drug_exposure as provided by the source.
omop cdm name: drug_exposure.verbatim_end_date#50 AS date

refills
type: DatatypeProperty
type: FunctionalProperty
domain: DrugExposure
range: integer
comment: (for DrugExposure:) The number of refills after the initial prescription. The initial prescription is not counted, values start with null.
omop cdm name: drug_exposure.refills#53 AS int

days supply
type: DatatypeProperty
type: FunctionalProperty
domain: DrugExposure
range: integer
comment: (for DrugExposure:) The number of days of supply of the medication as prescribed. This reflects the intention of the provider for the length of exposure.
omop cdm name: drug_exposure.days_supply#55 AS int

sig
type: DatatypeProperty
type: FunctionalProperty
domain: DrugExposure
range: string
comment: (for DrugExposure:) The directions ('signetur') on the Drug prescription as recorded in the original prescription (and printed on the container) or dispensing record.
omop cdm name: drug_exposure.sig#56 AS str

lot number
type: DatatypeProperty
type: FunctionalProperty
domain: DrugExposure
range: string
comment: (for DrugExposure:) An identifier assigned to a particular quantity or lot of Drug product from the manufacturer.
omop cdm name: drug_exposure.lot_number#58 AS str

route source value
type: DatatypeProperty
type: FunctionalProperty
domain: DrugExposure
range: string
comment: (for DrugExposure:) The information about the route of administration as detailed in the source.
omop cdm name: drug_exposure.route_source_value#64 AS str

dose unit source value
type: DatatypeProperty
type: FunctionalProperty
domain: DrugExposure
range: string
comment: (for DrugExposure:) The information about the dose unit as detailed in the source.
omop cdm name: drug_exposure.dose_unit_source_value#65 AS str

domain concept id 1
type: DatatypeProperty
type: FunctionalProperty
domain: FactRelationship
range: integer
comment: (for FactRelationship:) The concept representing the domain of fact one, from which the corresponding table can be inferred.
omop cdm name: fact_relationship.domain_concept_id_1#66 AS int

fact id 1
type: DatatypeProperty
type: FunctionalProperty
domain: FactRelationship
range: integer
comment: (for FactRelationship:) The unique identifier in the table corresponding to the domain of fact one.
omop cdm name: fact_relationship.fact_id_1#67 AS int

domain concept id 2
type: DatatypeProperty
type: FunctionalProperty
domain: FactRelationship
range: integer
comment: (for FactRelationship:) The concept representing the domain of fact two, from which the corresponding table can be inferred.
omop cdm name: fact_relationship.domain_concept_id_2#68 AS int

fact id 2
type: DatatypeProperty
type: FunctionalProperty
domain: FactRelationship
range: integer
comment: (for FactRelationship:) The unique identifier in the table corresponding to the domain of fact two.
omop cdm name: fact_relationship.fact_id_2#69 AS int

date
type: DatatypeProperty
type: FunctionalProperty
domain: Event
range: date
comment: (for Measurement:) The date of the Measurement.
comment: (for Note:) The date the note was recorded.
comment: (for NoteNlp:) The date of the note processing.Useful for data provenance.
comment: (for Observation:) The date of the observation.
comment: (for ProcedureOccurrence:) The date on which the Procedure was performed.
comment: (for Specimen:) The date the specimen was obtained from the Person.
omop cdm name: measurement.measurement_date#74 AS date
omop cdm name: note.note_date#95 AS date
omop cdm name: note_nlp.nlp_date#116 AS date
omop cdm name: observation.observation_date#124 AS date
omop cdm name: procedure_occurrence.procedure_date#169 AS date
omop cdm name: specimen.specimen_date#184 AS date

datetime
type: DatatypeProperty
type: FunctionalProperty
domain: Event
range: dateTime
comment: (for Measurement:) The date and time of the Measurement. Some database systems don't have a datatype of time. To accommodate all temporal analyses, datatype datetime can be used (combining measurement_date and measurement_time [forum discussion](http://forums.ohdsi.org/t/date-time-and-datetime-problem-and-the-world-of-hours-and-1day/314))
comment: (for Note:) The date and time the note was recorded.
comment: (for NoteNlp:) The date and time of the note processing. Useful for data provenance.
comment: (for Observation:) The date and time of the observation.
comment: (for ProcedureOccurrence:) The date and time on which the Procedure was performed.
comment: (for Specimen:) The date and time on the date when the Specimen was obtained from the person.
comment: (for Metadata:) The date and time associated with the metadata
omop cdm name: measurement.measurement_datetime#75 AS datetime
omop cdm name: note.note_datetime#96 AS datetime
omop cdm name: note_nlp.nlp_datetime#117 AS datetime
omop cdm name: observation.observation_datetime#125 AS datetime
omop cdm name: procedure_occurrence.procedure_datetime#170 AS datetime
omop cdm name: specimen.specimen_datetime#185 AS datetime
omop cdm name: metadata.metadata_datetime#366 AS datetime

time
type: DatatypeProperty
type: FunctionalProperty
domain: Measurement
range: string
comment: (for Measurement:) The time of the Measurement. This is present for backwards compatibility and will be deprecated in an upcoming version
omop cdm name: measurement.measurement_time#76 AS str

value as number
type: DatatypeProperty
type: FunctionalProperty
domain: Class
  union of: Measurement
  union of: Observation
range: decimal
comment: (for Measurement:) A Measurement result where the result is expressed as a numeric value.
comment: (for Observation:) The observation result stored as a number. This is applicable to observations where the result is expressed as a numeric value.
omop cdm name: measurement.value_as_number#79 AS float
omop cdm name: observation.value_as_number#127 AS float

range low
type: DatatypeProperty
type: FunctionalProperty
domain: Measurement
range: decimal
comment: (for Measurement:) The lower limit of the normal range of the Measurement result. The lower range is assumed to be of the same unit of measure as the Measurement value.
omop cdm name: measurement.range_low#82 AS float

range high
type: DatatypeProperty
type: FunctionalProperty
domain: Measurement
range: decimal
comment: (for Measurement:) The upper limit of the normal range of the Measurement. The upper range is assumed to be of the same unit of measure as the Measurement value.
omop cdm name: measurement.range_high#83 AS float

unit source value
type: DatatypeProperty
type: FunctionalProperty
domain: Class
  union of: Measurement
  union of: Specimen
  union of: Observation
range: string
comment: (for Measurement:) The source code for the unit as it appears in the source data. This code is mapped to a standard unit concept in the Standardized Vocabularies and the original code is stored here for reference.
comment: (for Observation:) The source code for the unit as it appears in the source data. This code is mapped to a standard unit concept in the Standardized Vocabularies and the original code is, stored here for reference.
comment: (for Specimen:) The information about the Unit as detailed in the source.
omop cdm name: measurement.unit_source_value#89 AS str
omop cdm name: observation.unit_source_value#137 AS str
omop cdm name: specimen.unit_source_value#192 AS str

value source value
type: DatatypeProperty
type: FunctionalProperty
domain: Measurement
range: string
comment: (for Measurement:) The source value associated with the content of the value_as_number or value_as_concept_id as stored in the source data.
omop cdm name: measurement.value_source_value#90 AS str

title
type: DatatypeProperty
type: FunctionalProperty
domain: Note
range: string
comment: (for Note:) The title of the Note as it appears in the source.
omop cdm name: note.note_title#99 AS str

text
type: DatatypeProperty
type: FunctionalProperty
domain: Note
range: string
comment: (for Note:) The content of the Note.
omop cdm name: note.note_text#100 AS str

snippet
type: DatatypeProperty
type: FunctionalProperty
domain: NoteNlp
range: string
comment: (for NoteNlp:) A small window of text surrounding the term.
omop cdm name: note_nlp.snippet#110 AS str

offset
type: DatatypeProperty
type: FunctionalProperty
domain: NoteNlp
range: string
comment: (for NoteNlp:) Character offset of the extracted term in the input note.
omop cdm name: note_nlp.offset#111 AS str

lexical variant
type: DatatypeProperty
type: FunctionalProperty
domain: NoteNlp
range: string
comment: (for NoteNlp:) Raw text extracted from the NLP tool.
omop cdm name: note_nlp.lexical_variant#112 AS str

system
type: DatatypeProperty
type: FunctionalProperty
domain: NoteNlp
range: string
comment: (for NoteNlp:) Name and version of the NLP system that extracted the term.Useful for data provenance.
omop cdm name: note_nlp.nlp_system#115 AS str

term exists
type: DatatypeProperty
type: FunctionalProperty
domain: NoteNlp
range: string
comment: (for NoteNlp:) A summary modifier that signifies presence or absence of the term for a given patient. Useful for quick querying.
omop cdm name: note_nlp.term_exists#118 AS str

term temporal
type: DatatypeProperty
type: FunctionalProperty
domain: NoteNlp
range: string
comment: (for NoteNlp:) An optional time modifier associated with the extracted term. (for now “past” or “present” only). Standardize it later.
omop cdm name: note_nlp.term_temporal#119 AS str

term modifiers
type: DatatypeProperty
type: FunctionalProperty
domain: NoteNlp
range: string
comment: (for NoteNlp:) A compact description of all the modifiers of the specific term extracted by the NLP system. (e.g. “son has rash” ? “negated=no,subject=family, certainty=undef,conditional=false,general=false”).
omop cdm name: note_nlp.term_modifiers#120 AS str

value as string
type: DatatypeProperty
type: FunctionalProperty
domain: Class
  union of: Metadata
  union of: Observation
range: string
comment: (for Observation:) The observation result stored as a string. This is applicable to observations where the result is expressed as verbatim text.
comment: (for Metadata:) The metadata value stored as a string.
omop cdm name: observation.value_as_string#128 AS str
omop cdm name: metadata.value_as_string#363 AS str

qualifier source value
type: DatatypeProperty
type: FunctionalProperty
domain: Observation
range: string
comment: (for Observation:) The source value associated with a qualifier to characterize the observation
omop cdm name: observation.qualifier_source_value#138 AS str

value as datetime
type: DatatypeProperty
type: FunctionalProperty
domain: Observation
range: integer
comment: (for Observation:) The observation result stored as a datetime value. This is applicable to observations where the result is expressed as a point in time.
omop cdm name: observation.value_as_datetime#141 AS int

year of birth
type: DatatypeProperty
type: FunctionalProperty
domain: Class
  union of: Provider
  union of: Person
range: integer
comment: (for Person:) The year of birth of the person. For data sources with date of birth, the year is extracted. For data sources where the year of birth is not available, the approximate year of birth is derived based on any age group categorization available.
comment: (for Provider:) The year of birth of the Provider.
omop cdm name: person.year_of_birth#149 AS int
omop cdm name: provider.year_of_birth#343 AS int

month of birth
type: DatatypeProperty
type: FunctionalProperty
domain: Person
range: integer
comment: (for Person:) The month of birth of the person. For data sources that provide the precise date of birth, the month is extracted and stored in this field.
omop cdm name: person.month_of_birth#150 AS int

day of birth
type: DatatypeProperty
type: FunctionalProperty
domain: Person
range: integer
comment: (for Person:) The day of the month of birth of the person. For data sources that provide the precise date of birth, the day is extracted and stored in this field.
omop cdm name: person.day_of_birth#151 AS int

birth datetime
type: DatatypeProperty
type: FunctionalProperty
domain: Person
range: dateTime
comment: (for Person:) The date and time of birth of the person.
omop cdm name: person.birth_datetime#152 AS datetime

death datetime
type: DatatypeProperty
type: FunctionalProperty
domain: Person
range: dateTime
comment: (for Person:) The date and time of death of the person.
omop cdm name: person.death_datetime#153 AS datetime

gender source value
type: DatatypeProperty
type: FunctionalProperty
domain: BasePerson
range: string
comment: (for Person:) The source code for the gender of the person as it appears in the source data. The person’s gender is mapped to a standard gender concept in the Standardized Vocabularies; the original value is stored here for reference.
comment: (for Provider:) The gender code for the Provider as it appears in the source data, stored here for reference.
omop cdm name: person.gender_source_value#160 AS str
omop cdm name: provider.gender_source_value#348 AS str

race source value
type: DatatypeProperty
type: FunctionalProperty
domain: Person
range: string
comment: (for Person:) The source code for the race of the person as it appears in the source data. The person race is mapped to a standard race concept in the Standardized Vocabularies and the original value is stored here for reference.
omop cdm name: person.race_source_value#162 AS str

ethnicity source value
type: DatatypeProperty
type: FunctionalProperty
domain: Person
range: string
comment: (for Person:) The source code for the ethnicity of the person as it appears in the source data. The person ethnicity is mapped to a standard ethnicity concept in the Standardized Vocabularies and the original code is, stored here for reference.
omop cdm name: person.ethnicity_source_value#164 AS str

modifier source value
type: DatatypeProperty
type: FunctionalProperty
domain: ProcedureOccurrence
range: string
comment: (for ProcedureOccurrence:) The source code for the qualifier as it appears in the source data.
omop cdm name: procedure_occurrence.modifier_source_value#179 AS str

anatomic site source value
type: DatatypeProperty
type: FunctionalProperty
domain: Specimen
range: string
comment: (for Specimen:) The information about the anatomic site as detailed in the source.
omop cdm name: specimen.anatomic_site_source_value#193 AS str

disease status source value
type: DatatypeProperty
type: FunctionalProperty
domain: Specimen
range: string
comment: (for Specimen:) The information about the disease status as detailed in the source.
omop cdm name: specimen.disease_status_source_value#194 AS str

survey start date
type: DatatypeProperty
type: FunctionalProperty
domain: SurveyConduct
range: date
comment: (for SurveyConduct:) Date on which the survey was started.
omop cdm name: survey_conduct.survey_start_date#198 AS date

survey start datetime
type: DatatypeProperty
type: FunctionalProperty
domain: SurveyConduct
range: dateTime
comment: (for SurveyConduct:) Date and time the survey was started.
omop cdm name: survey_conduct.survey_start_datetime#199 AS datetime

survey end date
type: DatatypeProperty
type: FunctionalProperty
domain: SurveyConduct
range: date
comment: (for SurveyConduct:) Date on which the survey was completed.
omop cdm name: survey_conduct.survey_end_date#200 AS date

survey end datetime
type: DatatypeProperty
type: FunctionalProperty
domain: SurveyConduct
range: dateTime
comment: (for SurveyConduct:) Date and time the survey was completed.
omop cdm name: survey_conduct.survey_end_datetime#201 AS datetime

assisted source value
type: DatatypeProperty
type: FunctionalProperty
domain: SurveyConduct
range: string
comment: (for SurveyConduct:) Source value representing whether patient required assistance to complete the survey. Example: “Completed without assistance”, ”Completed with assistance”.
omop cdm name: survey_conduct.assisted_source_value#207 AS str

respondent type source value
type: DatatypeProperty
type: FunctionalProperty
domain: SurveyConduct
range: string
comment: (for SurveyConduct:) Source code representing role of person who completed the survey.
omop cdm name: survey_conduct.respondent_type_source_value#208 AS str

timing source value
type: DatatypeProperty
type: FunctionalProperty
domain: SurveyConduct
range: string
comment: (for SurveyConduct:) Text string representing the timing of the survey. Example: Baseline, 6-month follow-up.
omop cdm name: survey_conduct.timing_source_value#209 AS str

collection method source value
type: DatatypeProperty
type: FunctionalProperty
domain: SurveyConduct
range: string
comment: (for SurveyConduct:) The collection method as it appears in the source data.
omop cdm name: survey_conduct.collection_method_source_value#210 AS str

survey source value
type: DatatypeProperty
type: FunctionalProperty
domain: SurveyConduct
range: string
comment: (for SurveyConduct:) The survey name/title as it appears in the source data.
omop cdm name: survey_conduct.survey_source_value#211 AS str

survey source identifier
type: DatatypeProperty
type: FunctionalProperty
domain: SurveyConduct
range: string
comment: (for SurveyConduct:) Unique identifier for each completed survey in source system.
omop cdm name: survey_conduct.survey_source_identifier#213 AS str

validated survey source value
type: DatatypeProperty
type: FunctionalProperty
domain: SurveyConduct
range: integer
comment: (for SurveyConduct:) Source value representing the validation status of the survey.
omop cdm name: survey_conduct.validated_survey_source_value#215 AS int

survey version number
type: DatatypeProperty
type: FunctionalProperty
domain: SurveyConduct
range: string
comment: (for SurveyConduct:) Version number of the questionnaire or survey used.
omop cdm name: survey_conduct.survey_version_number#216 AS str

admitted from source value
type: DatatypeProperty
type: FunctionalProperty
domain: VisitDetail
range: string
comment: (for VisitDetail:) The source code for the admitting source as it appears in the source data.
omop cdm name: visit_detail.admitted_from_source_value#231 AS str

discharge to source value
type: DatatypeProperty
type: FunctionalProperty
domain: BaseVisit
range: string
comment: (for VisitDetail:) The source code for the discharge disposition as it appears in the source data.
comment: (for VisitOccurrence:) The source code for the discharge disposition as it appears in the source data.
omop cdm name: visit_detail.discharge_to_source_value#233 AS str
omop cdm name: visit_occurrence.discharge_to_source_value#253 AS str

admitting source value
type: DatatypeProperty
type: FunctionalProperty
domain: VisitOccurrence
range: string
comment: (for VisitOccurrence:) The source code for the admitting source as it appears in the source data.
omop cdm name: visit_occurrence.admitting_source_value#251 AS str

occurrence count
type: DatatypeProperty
type: FunctionalProperty
domain: ConditionEra
range: integer
comment: (for ConditionEra:) The number of individual Condition Occurrences used to construct the condition era.
omop cdm name: condition_era.condition_occurrence_count#260 AS int

value
type: DatatypeProperty
type: FunctionalProperty
domain: DoseEra
range: decimal
comment: (for DoseEra:) The numeric value of the dose.
omop cdm name: dose_era.dose_value#265 AS float

exposure count
type: DatatypeProperty
type: FunctionalProperty
domain: DrugEra
range: integer
comment: (for DrugEra:) The number of individual Drug Exposure occurrences used to construct the Drug Era.
omop cdm name: drug_era.drug_exposure_count#273 AS int

gap days
type: DatatypeProperty
type: FunctionalProperty
domain: DrugEra
range: integer
comment: (for DrugEra:) The number of days that are not covered by DRUG_EXPOSURE records that were used to make up the era record.
omop cdm name: drug_era.gap_days#274 AS int

cost
type: DatatypeProperty
type: FunctionalProperty
domain: Cost
range: decimal
comment: (for Cost:) The actual financial cost amount
omop cdm name: cost.cost#284 AS float

incurred date
type: DatatypeProperty
type: FunctionalProperty
domain: Cost
range: date
comment: (for Cost:) The first date of service of the clinical event corresponding to the cost as in table capturing the information (e.g. date of visit, date of procedure, date of condition, date of drug etc).
omop cdm name: cost.incurred_date#285 AS date

billed date
type: DatatypeProperty
type: FunctionalProperty
domain: Cost
range: date
comment: (for Cost:) The date a bill was generated for a service or encounter
omop cdm name: cost.billed_date#286 AS date

paid date
type: DatatypeProperty
type: FunctionalProperty
domain: Cost
range: date
comment: (for Cost:) The date payment was received for a service or encounter
omop cdm name: cost.paid_date#287 AS date

revenue code source value
type: DatatypeProperty
type: FunctionalProperty
domain: Cost
range: string
comment: (for Cost:) The source value for the Revenue code as it appears in the source data, stored here for reference.
omop cdm name: cost.revenue_code_source_value#290 AS str

drg source value
type: DatatypeProperty
type: FunctionalProperty
domain: Cost
range: string
comment: (for Cost:) The source value for the 3-digit DRG source code as it appears in the source data, stored here for reference.
omop cdm name: cost.drg_source_value#291 AS str

payer source value
type: DatatypeProperty
type: FunctionalProperty
domain: PayerPlanPeriod
range: string
comment: (for PayerPlanPeriod:) The source code for the payer as it appears in the source data.
omop cdm name: payer_plan_period.payer_source_value#299 AS str

plan source value
type: DatatypeProperty
type: FunctionalProperty
domain: PayerPlanPeriod
range: string
comment: (for PayerPlanPeriod:) The source code for the Person's health benefit plan as it appears in the source data.
omop cdm name: payer_plan_period.plan_source_value#302 AS str

contract source value
type: DatatypeProperty
type: FunctionalProperty
domain: PayerPlanPeriod
range: integer
comment: (for PayerPlanPeriod:) The source code representing the reason justifying the contract. Usually it is family relationship like a spouse, domestic partner, child etc.
omop cdm name: payer_plan_period.contract_source_value#305 AS int

sponsor source value
type: DatatypeProperty
type: FunctionalProperty
domain: PayerPlanPeriod
range: string
comment: (for PayerPlanPeriod:) The source code for the Person's sponsor of the health plan as it appears in the source data.
omop cdm name: payer_plan_period.sponsor_source_value#308 AS str

family source value
type: DatatypeProperty
type: FunctionalProperty
domain: PayerPlanPeriod
range: string
comment: (for PayerPlanPeriod:) The source code for the Person's family as it appears in the source data.
omop cdm name: payer_plan_period.family_source_value#310 AS str

stop reason source value
type: DatatypeProperty
type: FunctionalProperty
domain: PayerPlanPeriod
range: string
comment: (for PayerPlanPeriod:) The reason for stop-coverage as it appears in the source data.
omop cdm name: payer_plan_period.stop_reason_source_value#312 AS str

place of service source value
type: DatatypeProperty
type: FunctionalProperty
domain: CareSite
range: string
comment: (for CareSite:) The source code for the Place of Service as it appears in the source data, stored here for reference.
omop cdm name: care_site.place_of_service_source_value#319 AS str

address 1
type: DatatypeProperty
type: FunctionalProperty
domain: Location
range: string
comment: (for Location:) The address field 1, typically used for the street address, as it appears in the source data.
omop cdm name: location.address_1#321 AS str

address 2
type: DatatypeProperty
type: FunctionalProperty
domain: Location
range: string
comment: (for Location:) The address field 2, typically used for additional detail such as buildings, suites, floors, as it appears in the source data.
omop cdm name: location.address_2#322 AS str

city
type: DatatypeProperty
type: FunctionalProperty
domain: Location
range: string
comment: (for Location:) The city field as it appears in the source data.
omop cdm name: location.city#323 AS str

state
type: DatatypeProperty
type: FunctionalProperty
domain: Location
range: string
comment: (for Location:) The state field as it appears in the source data.
omop cdm name: location.state#324 AS str

zip
type: DatatypeProperty
type: FunctionalProperty
domain: Location
range: string
comment: (for Location:) The zip or postal code.
omop cdm name: location.zip#325 AS str

county
type: DatatypeProperty
type: FunctionalProperty
domain: Location
range: string
comment: (for Location:) The county.
omop cdm name: location.county#326 AS str

country
type: DatatypeProperty
type: FunctionalProperty
domain: Location
range: string
comment: (for Location:) The country
omop cdm name: location.country#327 AS str

latitude
type: DatatypeProperty
type: FunctionalProperty
domain: Location
range: decimal
comment: (for Location:) The geocoded latitude
omop cdm name: location.latitude#329 AS float

longitude
type: DatatypeProperty
type: FunctionalProperty
domain: Location
range: decimal
comment: (for Location:) The geocoded longitude
omop cdm name: location.longitude#330 AS float

npi
type: DatatypeProperty
type: FunctionalProperty
domain: Provider
range: string
comment: (for Provider:) The National Provider Identifier (NPI) of the provider.
omop cdm name: provider.npi#339 AS str

dea
type: DatatypeProperty
type: FunctionalProperty
domain: Provider
range: string
comment: (for Provider:) The Drug Enforcement Administration (DEA) number of the provider.
omop cdm name: provider.dea#340 AS str

specialty source value
type: DatatypeProperty
type: FunctionalProperty
domain: Provider
range: string
comment: (for Provider:) The source code for the Provider specialty as it appears in the source data, stored here for reference.
omop cdm name: provider.specialty_source_value#346 AS str

abbreviation
type: DatatypeProperty
type: FunctionalProperty
domain: CdmSource
range: string
comment: (for CdmSource:) An abbreviation of the name
omop cdm name: cdm_source.cdm_source_abbreviation#351 AS str

cdm holder
type: DatatypeProperty
type: FunctionalProperty
domain: CdmSource
range: string
comment: (for CdmSource:) The name of the organization responsible for the development of the CDM instance
omop cdm name: cdm_source.cdm_holder#352 AS str

source description
type: DatatypeProperty
type: FunctionalProperty
domain: CdmSource
range: string
comment: (for CdmSource:) A description of the source data origin and purpose for collection. The description may contain a summary of the period of time that is expected to be covered by this dataset.
omop cdm name: cdm_source.source_description#353 AS str

source documentation reference
type: DatatypeProperty
type: FunctionalProperty
domain: CdmSource
range: string
comment: (for CdmSource:) URL or other external reference to location of source documentation
omop cdm name: cdm_source.source_documentation_reference#354 AS str

cdm etl reference
type: DatatypeProperty
type: FunctionalProperty
domain: CdmSource
range: string
comment: (for CdmSource:) URL or other external reference to location of ETL specification documentation and ETL source code
omop cdm name: cdm_source.cdm_etl_reference#355 AS str

source release date
type: DatatypeProperty
type: FunctionalProperty
domain: CdmSource
range: date
comment: (for CdmSource:) The date for which the source data are most current, such as the last day of data capture
omop cdm name: cdm_source.source_release_date#356 AS date

cdm release date
type: DatatypeProperty
type: FunctionalProperty
domain: CdmSource
range: date
comment: (for CdmSource:) The date when the CDM was instantiated
omop cdm name: cdm_source.cdm_release_date#357 AS date

cdm version
type: DatatypeProperty
type: FunctionalProperty
domain: CdmSource
range: string
comment: (for CdmSource:) The version of CDM used
omop cdm name: cdm_source.cdm_version#358 AS str

vocabulary version
type: DatatypeProperty
type: FunctionalProperty
domain: CdmSource
range: string
comment: (for CdmSource:) The version of the vocabulary used
omop cdm name: cdm_source.vocabulary_version#359 AS str

metadata date
type: DatatypeProperty
type: FunctionalProperty
domain: Metadata
range: date
comment: (for Metadata:) The date associated with the metadata
omop cdm name: metadata.metadata date#365 AS date

standard
type: DatatypeProperty
type: FunctionalProperty
domain: Concept
range: string
comment: (for Concept:) This flag determines where a Concept is a Standard Concept, i.e. is used in the data, a Classification Concept, or a non-standard Source Concept. The allowables values are 'S' (Standard Concept) and 'C' (Classification Concept), otherwise the content is NULL.
omop cdm name: concept.standard_concept#372 AS str

code
type: DatatypeProperty
type: FunctionalProperty
domain: Concept
range: string
comment: (for Concept:) The concept code represents the identifier of the Concept in the source vocabulary, such as SNOMED-CT concept IDs, RxNorm RXCUIs etc. Note that concept codes are not unique across vocabularies.
omop cdm name: concept.concept_code#373 AS str

valid start date
type: DatatypeProperty
type: FunctionalProperty
domain: Class
  union of: ConceptRelationship
  union of: SourceToConceptMap
  union of: DrugStrength
  union of: Concept
range: date
comment: (for Concept:) The date when the Concept was first recorded. The default value is 1-Jan-1970, meaning, the Concept has no (known) date of inception.
comment: (for ConceptRelationship:) The date when the instance of the Concept Relationship is first recorded.
comment: (for DrugStrength:) The date when the Concept was first recorded. The default value is 1-Jan-1970.
comment: (for SourceToConceptMap:) The date when the mapping instance was first recorded.
omop cdm name: concept.valid_start_date#374 AS date
omop cdm name: concept_relationship.valid_start_date#387 AS date
omop cdm name: drug_strength.valid_start_date#405 AS date
omop cdm name: source_to_concept_map.valid_start_date#420 AS date

valid end date
type: DatatypeProperty
type: FunctionalProperty
domain: Class
  union of: ConceptRelationship
  union of: SourceToConceptMap
  union of: DrugStrength
  union of: Concept
range: date
comment: (for Concept:) The date when the Concept became invalid because it was deleted or superseded (updated) by a new concept. The default value is 31-Dec-2099, meaning, the Concept is valid until it becomes deprecated.
comment: (for ConceptRelationship:) The date when the Concept Relationship became invalid because it was deleted or superseded (updated) by a new relationship. Default value is 31-Dec-2099.
comment: (for DrugStrength:) The date when the concept became invalid because it was deleted or superseded (updated) by a new Concept. The default value is 31-Dec-2099.
comment: (for SourceToConceptMap:) The date when the mapping instance became invalid because it was deleted or superseded (updated) by a new relationship. Default value is 31-Dec-2099.
omop cdm name: concept.valid_end_date#375 AS date
omop cdm name: concept_relationship.valid_end_date#388 AS date
omop cdm name: drug_strength.valid_end_date#406 AS date
omop cdm name: source_to_concept_map.valid_end_date#421 AS date

invalid reason
type: DatatypeProperty
type: FunctionalProperty
domain: Class
  union of: ConceptRelationship
  union of: SourceToConceptMap
  union of: DrugStrength
  union of: Concept
range: string
comment: (for Concept:) Reason the Concept was invalidated. Possible values are D (deleted), U (replaced with an update) or NULL when valid_end_date has the default value.
comment: (for ConceptRelationship:) Reason the relationship was invalidated. Possible values are 'D' (deleted), 'U' (replaced with an update) or NULL when valid_end_date has the default value.
comment: (for DrugStrength:) Reason the concept was invalidated. Possible values are 'D' (deleted), 'U' (replaced with an update) or NULL when valid_end_date has the default value.
comment: (for SourceToConceptMap:) Reason the mapping instance was invalidated. Possible values are D (deleted), U (replaced with an update) or NULL when valid_end_date has the default value.
omop cdm name: concept.invalid_reason#376 AS str
omop cdm name: concept_relationship.invalid_reason#389 AS str
omop cdm name: drug_strength.invalid_reason#407 AS str
omop cdm name: source_to_concept_map.invalid_reason#422 AS str

min levels of separation
type: DatatypeProperty
type: FunctionalProperty
domain: ConceptAncestor
range: integer
comment: (for ConceptAncestor:) The minimum separation in number of levels of hierarchy between ancestor and descendant concepts. This is an attribute that is used to simplify hierarchic analysis.
omop cdm name: concept_ancestor.min_levels_of_separation#379 AS int

max levels of separation
type: DatatypeProperty
type: FunctionalProperty
domain: ConceptAncestor
range: integer
comment: (for ConceptAncestor:) The maximum separation in number of levels of hierarchy between ancestor and descendant concepts. This is an attribute that is used to simplify hierarchic analysis.
omop cdm name: concept_ancestor.max_levels_of_separation#380 AS int

concept id 1
type: DatatypeProperty
type: FunctionalProperty
domain: ConceptRelationship
range: integer
comment: (for ConceptRelationship:) A foreign key to a Concept in the [CONCEPT](https://github.com/OHDSI/CommonDataModel/wiki/CONCEPT) table associated with the relationship. Relationships are directional, and this field represents the source concept designation.
omop cdm name: concept_relationship.concept_id_1#384 AS int

concept id 2
type: DatatypeProperty
type: FunctionalProperty
domain: ConceptRelationship
range: integer
comment: (for ConceptRelationship:) A foreign key to a Concept in the [CONCEPT](https://github.com/OHDSI/CommonDataModel/wiki/CONCEPT) table associated with the relationship. Relationships are directional, and this field represents the destination concept designation.
omop cdm name: concept_relationship.concept_id_2#385 AS int

amount value
type: DatatypeProperty
type: FunctionalProperty
domain: DrugStrength
range: decimal
comment: (for DrugStrength:) The numeric value associated with the amount of active ingredient contained within the product.
omop cdm name: drug_strength.amount_value#398 AS float

numerator value
type: DatatypeProperty
type: FunctionalProperty
domain: DrugStrength
range: decimal
comment: (for DrugStrength:) The numeric value associated with the concentration of the active ingredient contained in the product
omop cdm name: drug_strength.numerator_value#400 AS float

denominator value
type: DatatypeProperty
type: FunctionalProperty
domain: DrugStrength
range: decimal
comment: (for DrugStrength:) The amount of total liquid (or other divisible product, such as ointment, gel, spray, etc.).
omop cdm name: drug_strength.denominator_value#402 AS float

box size
type: DatatypeProperty
type: FunctionalProperty
domain: DrugStrength
range: integer
comment: (for DrugStrength:) The number of units of Clinical of Branded Drug, or Quantified Clinical or Branded Drug contained in a box as dispensed to the patient
omop cdm name: drug_strength.box_size#404 AS int

is hierarchical
type: DatatypeProperty
type: FunctionalProperty
domain: Relationship
range: string
comment: (for Relationship:) Defines whether a relationship defines concepts into classes or hierarchies. Values are 1 for hierarchical relationship or 0 if not.
omop cdm name: relationship.is_hierarchical#410 AS str

defines ancestry
type: DatatypeProperty
type: FunctionalProperty
domain: Relationship
range: string
comment: (for Relationship:) Defines whether a hierarchical relationship contributes to the concept_ancestor table. These are subsets of the hierarchical relationships. Valid values are 1 or 0.
omop cdm name: relationship.defines_ancestry#411 AS str

source code
type: DatatypeProperty
type: FunctionalProperty
domain: SourceToConceptMap
range: string
comment: (for SourceToConceptMap:) The source code being translated into a Standard Concept.
omop cdm name: source_to_concept_map.source_code#414 AS str

source code description
type: DatatypeProperty
type: FunctionalProperty
domain: SourceToConceptMap
range: string
comment: (for SourceToConceptMap:) An optional description for the source code. This is included as a convenience to compare the description of the source code to the name of the concept.
omop cdm name: source_to_concept_map.source_code_description#417 AS str

reference
type: DatatypeProperty
type: FunctionalProperty
domain: Vocabulary
range: string
comment: (for Vocabulary:) External reference to documentation or available download of the about the vocabulary.
omop cdm name: vocabulary.vocabulary_reference#425 AS str

version
type: DatatypeProperty
type: FunctionalProperty
domain: Vocabulary
range: string
comment: (for Vocabulary:) Version of the Vocabulary as indicated in the source.
omop cdm name: vocabulary.vocabulary_version#426 AS str

Concept
type: Class
subclass of: OmopCDMThing
subclass of: Restriction
  on property: name
  all values from: string
subclass of: Restriction
  on property: name
  some values from: string
subclass of: Restriction
  on property: has class
  all values from: ConceptClass
subclass of: Restriction
  on property: has class
  some values from: ConceptClass
subclass of: Restriction
  on property: has domain
  all values from: Domain
subclass of: Restriction
  on property: has domain
  some values from: Domain
subclass of: Restriction
  on property: has vocabulary
  all values from: Vocabulary
subclass of: Restriction
  on property: has vocabulary
  some values from: Vocabulary
subclass of: Restriction
  on property: standard
  all values from: string
subclass of: Restriction
  on property: standard
  some values from: string
subclass of: Restriction
  on property: code
  all values from: string
subclass of: Restriction
  on property: code
  some values from: string
subclass of: Restriction
  on property: valid start date
  all values from: date
subclass of: Restriction
  on property: valid start date
  some values from: date
subclass of: Restriction
  on property: valid end date
  all values from: date
subclass of: Restriction
  on property: valid end date
  some values from: date
subclass of: Restriction
  on property: invalid reason
  all values from: string
subclass of: Restriction
  on property: invalid reason
  some values from: string
omop cdm name: concept

DrugEra
type: Class
subclass of: Era
subclass of: Restriction
  on property:
    inverse of: has drug era
  some values from: Person
subclass of: Restriction
  on property: exposure count
  all values from: integer
subclass of: Restriction
  on property: exposure count
  some values from: integer
subclass of: Restriction
  on property: gap days
  all values from: integer
subclass of: Restriction
  on property: gap days
  some values from: integer
omop cdm name: drug_era

Vocabulary
type: Class
subclass of: OmopCDMThing
subclass of: Restriction
  on property: name
  all values from: string
subclass of: Restriction
  on property: name
  some values from: string
subclass of: Restriction
  on property: has concept
  all values from: Concept
subclass of: Restriction
  on property: has concept
  some values from: Concept
subclass of: Restriction
  on property: reference
  all values from: string
subclass of: Restriction
  on property: reference
  some values from: string
subclass of: Restriction
  on property: version
  all values from: string
subclass of: Restriction
  on property: version
  some values from: string
omop cdm name: vocabulary

DrugStrength
type: Class
subclass of: OmopCDMThing
subclass of: Restriction
  on property: has concept
  all values from: Concept
subclass of: Restriction
  on property: has concept
  some values from: Concept
subclass of: Restriction
  on property: valid start date
  all values from: date
subclass of: Restriction
  on property: valid start date
  some values from: date
subclass of: Restriction
  on property: valid end date
  all values from: date
subclass of: Restriction
  on property: valid end date
  some values from: date
subclass of: Restriction
  on property: invalid reason
  all values from: string
subclass of: Restriction
  on property: invalid reason
  some values from: string
subclass of: Restriction
  on property: has ingredient
  all values from: Concept
subclass of: Restriction
  on property: has ingredient
  some values from: Concept
subclass of: Restriction
  on property: amount value
  all values from: decimal
subclass of: Restriction
  on property: amount value
  some values from: decimal
subclass of: Restriction
  on property: has amount unit
  all values from: Concept
subclass of: Restriction
  on property: has amount unit
  some values from: Concept
subclass of: Restriction
  on property: numerator value
  all values from: decimal
subclass of: Restriction
  on property: numerator value
  some values from: decimal
subclass of: Restriction
  on property: has numerator unit
  all values from: Concept
subclass of: Restriction
  on property: has numerator unit
  some values from: Concept
subclass of: Restriction
  on property: denominator value
  all values from: decimal
subclass of: Restriction
  on property: denominator value
  some values from: decimal
subclass of: Restriction
  on property: has denominator unit
  all values from: Concept
subclass of: Restriction
  on property: has denominator unit
  some values from: Concept
subclass of: Restriction
  on property: box size
  all values from: integer
subclass of: Restriction
  on property: box size
  some values from: integer
omop cdm name: drug_strength

Note
type: Class
subclass of: ClinicalElement
subclass of: Event
subclass of: Restriction
  on property: has type
  all values from: Concept
subclass of: Restriction
  on property: has type
  some values from: Concept
subclass of: Restriction
  on property: has provider
  all values from: Provider
subclass of: Restriction
  on property: has provider
  some values from: Provider
subclass of: Restriction
  on property: source value
  all values from: string
subclass of: Restriction
  on property: source value
  some values from: string
subclass of: Restriction
  on property:
    inverse of: has note
  some values from: Person
subclass of: Restriction
  on property:
    inverse of: has note
  some values from: BaseVisit
subclass of: Restriction
  on property: has event
  all values from: Thing
subclass of: Restriction
  on property: has event
  some values from: Thing
subclass of: Restriction
  on property: has event field
  all values from: Concept
subclass of: Restriction
  on property: has event field
  some values from: Concept
subclass of: Restriction
  on property: has class
  all values from: Concept
subclass of: Restriction
  on property: has class
  some values from: Concept
subclass of: Restriction
  on property: title
  all values from: string
subclass of: Restriction
  on property: title
  some values from: string
subclass of: Restriction
  on property: text
  all values from: string
subclass of: Restriction
  on property: text
  some values from: string
subclass of: Restriction
  on property: has encoding
  all values from: Concept
subclass of: Restriction
  on property: has encoding
  some values from: Concept
subclass of: Restriction
  on property: has language
  all values from: Concept
subclass of: Restriction
  on property: has language
  some values from: Concept
subclass of: Restriction
  on property: has note nlp
  all values from: NoteNlp
omop cdm name: note

CareSite
type: Class
subclass of: OmopCDMThing
subclass of: Restriction
  on property: name
  all values from: string
subclass of: Restriction
  on property: name
  some values from: string
subclass of: Restriction
  on property: source value
  all values from: string
subclass of: Restriction
  on property: source value
  some values from: string
subclass of: Restriction
  on property: has location
  all values from: Location
subclass of: Restriction
  on property: has location
  some values from: Location
subclass of: Restriction
  on property: has place of service
  all values from: Concept
subclass of: Restriction
  on property: has place of service
  some values from: Concept
subclass of: Restriction
  on property: place of service source value
  all values from: string
subclass of: Restriction
  on property: place of service source value
  some values from: string
omop cdm name: care_site

Cohort
type: Class
subclass of: OmopCDMThing
subclass of: DateDuration
subclass of: Restriction
  on property: has definition
  all values from: CohortDefinition
subclass of: Restriction
  on property: has definition
  some values from: CohortDefinition
subclass of: Restriction
  on property: has subject
  all values from: VisitOccurrence
subclass of: Restriction
  on property: has subject
  some values from: VisitOccurrence
omop cdm name: cohort

Person
type: Class
subclass of: BasePerson
subclass of: Restriction
  on property: has condition occurrence
  all values from: ConditionOccurrence
subclass of: Restriction
  on property: has provider
  all values from: Provider
subclass of: Restriction
  on property: has provider
  some values from: Provider
subclass of: Restriction
  on property: has device exposure
  all values from: DeviceExposure
subclass of: Restriction
  on property: has drug exposure
  all values from: DrugExposure
subclass of: Restriction
  on property: has measurement
  all values from: Measurement
subclass of: Restriction
  on property: has note
  all values from: Note
subclass of: Restriction
  on property: has observation
  all values from: Observation
subclass of: Restriction
  on property: has observation period
  all values from: ObservationPeriod
subclass of: Restriction
  on property: year of birth
  all values from: integer
subclass of: Restriction
  on property: year of birth
  some values from: integer
subclass of: Restriction
  on property: month of birth
  all values from: integer
subclass of: Restriction
  on property: month of birth
  some values from: integer
subclass of: Restriction
  on property: day of birth
  all values from: integer
subclass of: Restriction
  on property: day of birth
  some values from: integer
subclass of: Restriction
  on property: birth datetime
  all values from: dateTime
subclass of: Restriction
  on property: birth datetime
  some values from: dateTime
subclass of: Restriction
  on property: death datetime
  all values from: dateTime
subclass of: Restriction
  on property: death datetime
  some values from: dateTime
subclass of: Restriction
  on property: has race
  all values from: Concept
subclass of: Restriction
  on property: has race
  some values from: Concept
subclass of: Restriction
  on property: has ethnicity
  all values from: Concept
subclass of: Restriction
  on property: has ethnicity
  some values from: Concept
subclass of: Restriction
  on property: has location
  all values from: Location
subclass of: Restriction
  on property: has location
  some values from: Location
subclass of: Restriction
  on property: race source value
  all values from: string
subclass of: Restriction
  on property: race source value
  some values from: string
subclass of: Restriction
  on property: has race source
  all values from: Concept
subclass of: Restriction
  on property: has race source
  some values from: Concept
subclass of: Restriction
  on property: ethnicity source value
  all values from: string
subclass of: Restriction
  on property: ethnicity source value
  some values from: string
subclass of: Restriction
  on property: has ethnicity source
  all values from: Concept
subclass of: Restriction
  on property: has ethnicity source
  some values from: Concept
subclass of: Restriction
  on property: has procedure occurrence
  all values from: ProcedureOccurrence
subclass of: Restriction
  on property: has specimen
  all values from: Specimen
subclass of: Restriction
  on property: has survey conduct
  all values from: SurveyConduct
subclass of: Restriction
  on property: has visit detail
  all values from: VisitDetail
subclass of: Restriction
  on property: has visit occurrence
  all values from: VisitOccurrence
subclass of: Restriction
  on property: has condition era
  all values from: ConditionEra
subclass of: Restriction
  on property: has dose era
  all values from: DoseEra
subclass of: Restriction
  on property: has drug era
  all values from: DrugEra
subclass of: Restriction
  on property: has cost
  all values from: Cost
subclass of: Restriction
  on property: has payer plan period
  all values from: PayerPlanPeriod
omop cdm name: person

CdmSource
type: Class
subclass of: OmopCDMThing
subclass of: Restriction
  on property: name
  all values from: string
subclass of: Restriction
  on property: name
  some values from: string
subclass of: Restriction
  on property: abbreviation
  all values from: string
subclass of: Restriction
  on property: abbreviation
  some values from: string
subclass of: Restriction
  on property: cdm holder
  all values from: string
subclass of: Restriction
  on property: cdm holder
  some values from: string
subclass of: Restriction
  on property: source description
  all values from: string
subclass of: Restriction
  on property: source description
  some values from: string
subclass of: Restriction
  on property: source documentation reference
  all values from: string
subclass of: Restriction
  on property: source documentation reference
  some values from: string
subclass of: Restriction
  on property: cdm etl reference
  all values from: string
subclass of: Restriction
  on property: cdm etl reference
  some values from: string
subclass of: Restriction
  on property: source release date
  all values from: date
subclass of: Restriction
  on property: source release date
  some values from: date
subclass of: Restriction
  on property: cdm release date
  all values from: date
subclass of: Restriction
  on property: cdm release date
  some values from: date
subclass of: Restriction
  on property: cdm version
  all values from: string
subclass of: Restriction
  on property: cdm version
  some values from: string
subclass of: Restriction
  on property: vocabulary version
  all values from: string
subclass of: Restriction
  on property: vocabulary version
  some values from: string
omop cdm name: cdm_source

DoseEra
type: Class
subclass of: Era
subclass of: Restriction
  on property: has unit
  all values from: Concept
subclass of: Restriction
  on property: has unit
  some values from: Concept
subclass of: Restriction
  on property:
    inverse of: has dose era
  some values from: Person
subclass of: Restriction
  on property: value
  all values from: decimal
subclass of: Restriction
  on property: value
  some values from: decimal
omop cdm name: dose_era

ConceptClass
type: Class
subclass of: OmopCDMThing
subclass of: Restriction
  on property: name
  all values from: string
subclass of: Restriction
  on property: name
  some values from: string
subclass of: Restriction
  on property: has concept
  all values from: Concept
subclass of: Restriction
  on property: has concept
  some values from: Concept
omop cdm name: concept_class

SourceToConceptMap
type: Class
subclass of: OmopCDMThing
subclass of: Restriction
  on property: has source
  all values from: Concept
subclass of: Restriction
  on property: has source
  some values from: Concept
subclass of: Restriction
  on property: valid start date
  all values from: date
subclass of: Restriction
  on property: valid start date
  some values from: date
subclass of: Restriction
  on property: valid end date
  all values from: date
subclass of: Restriction
  on property: valid end date
  some values from: date
subclass of: Restriction
  on property: invalid reason
  all values from: string
subclass of: Restriction
  on property: invalid reason
  some values from: string
subclass of: Restriction
  on property: source code
  all values from: string
subclass of: Restriction
  on property: source code
  some values from: string
subclass of: Restriction
  on property: has source vocabulary
  all values from: Vocabulary
subclass of: Restriction
  on property: has source vocabulary
  some values from: Vocabulary
subclass of: Restriction
  on property: source code description
  all values from: string
subclass of: Restriction
  on property: source code description
  some values from: string
subclass of: Restriction
  on property: has target
  all values from: Concept
subclass of: Restriction
  on property: has target
  some values from: Concept
subclass of: Restriction
  on property: has target vocabulary
  all values from: Vocabulary
subclass of: Restriction
  on property: has target vocabulary
  some values from: Vocabulary
omop cdm name: source_to_concept_map

SurveyConduct
type: Class
subclass of: OmopCDMThing
subclass of: Restriction
  on property: has provider
  all values from: Provider
subclass of: Restriction
  on property: has provider
  some values from: Provider
subclass of: Restriction
  on property:
    inverse of: has survey conduct
  some values from: Person
subclass of: Restriction
  on property:
    inverse of: has survey conduct
  some values from: VisitOccurrence
subclass of: Restriction
  on property: has survey
  all values from: Concept
subclass of: Restriction
  on property: has survey
  some values from: Concept
subclass of: Restriction
  on property: survey start date
  all values from: date
subclass of: Restriction
  on property: survey start date
  some values from: date
subclass of: Restriction
  on property: survey start datetime
  all values from: dateTime
subclass of: Restriction
  on property: survey start datetime
  some values from: dateTime
subclass of: Restriction
  on property: survey end date
  all values from: date
subclass of: Restriction
  on property: survey end date
  some values from: date
subclass of: Restriction
  on property: survey end datetime
  all values from: dateTime
subclass of: Restriction
  on property: survey end datetime
  some values from: dateTime
subclass of: Restriction
  on property: has assisted
  all values from: Concept
subclass of: Restriction
  on property: has assisted
  some values from: Concept
subclass of: Restriction
  on property: has respondent type
  all values from: Concept
subclass of: Restriction
  on property: has respondent type
  some values from: Concept
subclass of: Restriction
  on property: has timing
  all values from: Concept
subclass of: Restriction
  on property: has timing
  some values from: Concept
subclass of: Restriction
  on property: has collection method
  all values from: Concept
subclass of: Restriction
  on property: has collection method
  some values from: Concept
subclass of: Restriction
  on property: assisted source value
  all values from: string
subclass of: Restriction
  on property: assisted source value
  some values from: string
subclass of: Restriction
  on property: respondent type source value
  all values from: string
subclass of: Restriction
  on property: respondent type source value
  some values from: string
subclass of: Restriction
  on property: timing source value
  all values from: string
subclass of: Restriction
  on property: timing source value
  some values from: string
subclass of: Restriction
  on property: collection method source value
  all values from: string
subclass of: Restriction
  on property: collection method source value
  some values from: string
subclass of: Restriction
  on property: survey source value
  all values from: string
subclass of: Restriction
  on property: survey source value
  some values from: string
subclass of: Restriction
  on property: has survey source
  all values from: Concept
subclass of: Restriction
  on property: has survey source
  some values from: Concept
subclass of: Restriction
  on property: survey source identifier
  all values from: string
subclass of: Restriction
  on property: survey source identifier
  some values from: string
subclass of: Restriction
  on property: has validated survey
  all values from: Concept
subclass of: Restriction
  on property: has validated survey
  some values from: Concept
subclass of: Restriction
  on property: validated survey source value
  all values from: integer
subclass of: Restriction
  on property: validated survey source value
  some values from: integer
subclass of: Restriction
  on property: survey version number
  all values from: string
subclass of: Restriction
  on property: survey version number
  some values from: string
subclass of: Restriction
  on property: has response visit occurrence
  all values from: VisitOccurrence
subclass of: Restriction
  on property: has response visit occurrence
  some values from: VisitOccurrence
omop cdm name: survey_conduct

FactRelationship
type: Class
subclass of: OmopCDMThing
subclass of: Restriction
  on property: domain concept id 1
  all values from: integer
subclass of: Restriction
  on property: domain concept id 1
  some values from: integer
subclass of: Restriction
  on property: fact id 1
  all values from: integer
subclass of: Restriction
  on property: fact id 1
  some values from: integer
subclass of: Restriction
  on property: domain concept id 2
  all values from: integer
subclass of: Restriction
  on property: domain concept id 2
  some values from: integer
subclass of: Restriction
  on property: fact id 2
  all values from: integer
subclass of: Restriction
  on property: fact id 2
  some values from: integer
subclass of: Restriction
  on property: has relationship
  all values from: Concept
subclass of: Restriction
  on property: has relationship
  some values from: Concept
omop cdm name: fact_relationship

VisitDetail
type: Class
subclass of: BaseVisit
subclass of: Restriction
  on property:
    inverse of: has visit detail
  some values from: Person
subclass of: Restriction
  on property:
    inverse of: has visit detail
  some values from: VisitOccurrence
subclass of: Restriction
  on property: admitted from source value
  all values from: string
subclass of: Restriction
  on property: admitted from source value
  some values from: string
subclass of: Restriction
  on property: has admitted from
  all values from: Concept
subclass of: Restriction
  on property: has admitted from
  some values from: Concept
subclass of: Restriction
  on property: has preceding visit detail
  all values from: VisitDetail
subclass of: Restriction
  on property: has preceding visit detail
  some values from: VisitDetail
subclass of: Restriction
  on property: has parent
  all values from: VisitDetail
subclass of: Restriction
  on property: has parent
  some values from: VisitDetail
omop cdm name: visit_detail

ConceptAncestor
type: Class
subclass of: OmopCDMThing
subclass of: Restriction
  on property: has ancestor
  all values from: Concept
subclass of: Restriction
  on property: has ancestor
  some values from: Concept
subclass of: Restriction
  on property: has descendant
  all values from: Concept
subclass of: Restriction
  on property: has descendant
  some values from: Concept
subclass of: Restriction
  on property: min levels of separation
  all values from: integer
subclass of: Restriction
  on property: min levels of separation
  some values from: integer
subclass of: Restriction
  on property: max levels of separation
  all values from: integer
subclass of: Restriction
  on property: max levels of separation
  some values from: integer
omop cdm name: concept_ancestor

ConditionOccurrence
type: Class
subclass of: Occurrence
subclass of: DateDuration
subclass of: DatetimeDuration
subclass of: Restriction
  on property:
    inverse of: has condition occurrence
  some values from: Person
subclass of: Restriction
  on property:
    inverse of: has condition occurrence
  some values from: BaseVisit
subclass of: Restriction
  on property: has concept
  all values from: Concept
subclass of: Restriction
  on property: has concept
  some values from: Concept
subclass of: Restriction
  on property: has type
  all values from: Concept
subclass of: Restriction
  on property: has type
  some values from: Concept
subclass of: Restriction
  on property: has status
  all values from: Concept
subclass of: Restriction
  on property: has status
  some values from: Concept
subclass of: Restriction
  on property: stop reason
  all values from: string
subclass of: Restriction
  on property: stop reason
  some values from: string
subclass of: Restriction
  on property: has provider
  all values from: Provider
subclass of: Restriction
  on property: has provider
  some values from: Provider
subclass of: Restriction
  on property: source value
  all values from: string
subclass of: Restriction
  on property: source value
  some values from: string
subclass of: Restriction
  on property: has source
  all values from: Concept
subclass of: Restriction
  on property: has source
  some values from: Concept
subclass of: Restriction
  on property: status source value
  all values from: string
subclass of: Restriction
  on property: status source value
  some values from: string
omop cdm name: condition_occurrence

Measurement
type: Class
subclass of: Occurrence
subclass of: Event
subclass of: Restriction
  on property: has concept
  all values from: Concept
subclass of: Restriction
  on property: has concept
  some values from: Concept
subclass of: Restriction
  on property: has type
  all values from: Concept
subclass of: Restriction
  on property: has type
  some values from: Concept
subclass of: Restriction
  on property: has provider
  all values from: Provider
subclass of: Restriction
  on property: has provider
  some values from: Provider
subclass of: Restriction
  on property: source value
  all values from: string
subclass of: Restriction
  on property: source value
  some values from: string
subclass of: Restriction
  on property: has source
  all values from: Concept
subclass of: Restriction
  on property: has source
  some values from: Concept
subclass of: Restriction
  on property:
    inverse of: has measurement
  some values from: Person
subclass of: Restriction
  on property:
    inverse of: has measurement
  some values from: BaseVisit
subclass of: Restriction
  on property: time
  all values from: string
subclass of: Restriction
  on property: time
  some values from: string
subclass of: Restriction
  on property: has operator
  all values from: Concept
subclass of: Restriction
  on property: has operator
  some values from: Concept
subclass of: Restriction
  on property: value as number
  all values from: decimal
subclass of: Restriction
  on property: value as number
  some values from: decimal
subclass of: Restriction
  on property: has value as concept
  all values from: Concept
subclass of: Restriction
  on property: has value as concept
  some values from: Concept
subclass of: Restriction
  on property: has unit
  all values from: Concept
subclass of: Restriction
  on property: has unit
  some values from: Concept
subclass of: Restriction
  on property: range low
  all values from: decimal
subclass of: Restriction
  on property: range low
  some values from: decimal
subclass of: Restriction
  on property: range high
  all values from: decimal
subclass of: Restriction
  on property: range high
  some values from: decimal
subclass of: Restriction
  on property: unit source value
  all values from: string
subclass of: Restriction
  on property: unit source value
  some values from: string
subclass of: Restriction
  on property: value source value
  all values from: string
subclass of: Restriction
  on property: value source value
  some values from: string
omop cdm name: measurement

LocationHistory
type: Class
subclass of: OmopCDMThing
subclass of: DateDuration
subclass of: Restriction
  on property: has location
  all values from: Location
subclass of: Restriction
  on property: has location
  some values from: Location
subclass of: Restriction
  on property: has relationship type
  all values from: Concept
subclass of: Restriction
  on property: has relationship type
  some values from: Concept
subclass of: Restriction
  on property: has domain
  all values from: Domain
subclass of: Restriction
  on property: has domain
  some values from: Domain
subclass of: Restriction
  on property: has entity
  all values from: Thing
subclass of: Restriction
  on property: has entity
  some values from: Thing
omop cdm name: location_history

Observation
type: Class
subclass of: OmopCDMThing
subclass of: Event
subclass of: Restriction
  on property: has concept
  all values from: Concept
subclass of: Restriction
  on property: has concept
  some values from: Concept
subclass of: Restriction
  on property: has type
  all values from: Concept
subclass of: Restriction
  on property: has type
  some values from: Concept
subclass of: Restriction
  on property: has provider
  all values from: Provider
subclass of: Restriction
  on property: has provider
  some values from: Provider
subclass of: Restriction
  on property: source value
  all values from: string
subclass of: Restriction
  on property: source value
  some values from: string
subclass of: Restriction
  on property: has source
  all values from: Concept
subclass of: Restriction
  on property: has source
  some values from: Concept
subclass of: Restriction
  on property: value as number
  all values from: decimal
subclass of: Restriction
  on property: value as number
  some values from: decimal
subclass of: Restriction
  on property: has value as concept
  all values from: Concept
subclass of: Restriction
  on property: has value as concept
  some values from: Concept
subclass of: Restriction
  on property: has unit
  all values from: Concept
subclass of: Restriction
  on property: has unit
  some values from: Concept
subclass of: Restriction
  on property: unit source value
  all values from: string
subclass of: Restriction
  on property: unit source value
  some values from: string
subclass of: Restriction
  on property: has event
  all values from: Thing
subclass of: Restriction
  on property: has event
  some values from: Thing
subclass of: Restriction
  on property:
    inverse of: has observation
  some values from: Person
subclass of: Restriction
  on property:
    inverse of: has observation
  some values from: BaseVisit
subclass of: Restriction
  on property: value as string
  all values from: string
subclass of: Restriction
  on property: value as string
  some values from: string
subclass of: Restriction
  on property: has qualifier
  all values from: Concept
subclass of: Restriction
  on property: has qualifier
  some values from: Concept
subclass of: Restriction
  on property: qualifier source value
  all values from: string
subclass of: Restriction
  on property: qualifier source value
  some values from: string
subclass of: Restriction
  on property: has obs event field
  all values from: Concept
subclass of: Restriction
  on property: has obs event field
  some values from: Concept
subclass of: Restriction
  on property: value as datetime
  all values from: integer
subclass of: Restriction
  on property: value as datetime
  some values from: integer
omop cdm name: observation

ObservationPeriod
type: Class
subclass of: ClinicalElement
subclass of: DateDuration
subclass of: Restriction
  on property:
    inverse of: has observation period
  some values from: Person
subclass of: Restriction
  on property: has period type
  all values from: Concept
subclass of: Restriction
  on property: has period type
  some values from: Concept
omop cdm name: observation_period

ConceptSynonym
type: Class
subclass of: OmopCDMThing
subclass of: Restriction
  on property: name
  all values from: string
subclass of: Restriction
  on property: name
  some values from: string
subclass of: Restriction
  on property: has concept
  all values from: Concept
subclass of: Restriction
  on property: has concept
  some values from: Concept
subclass of: Restriction
  on property: has language
  all values from: Concept
subclass of: Restriction
  on property: has language
  some values from: Concept
omop cdm name: concept_synonym

NoteNlp
type: Class
subclass of: OmopCDMThing
subclass of: Event
subclass of: Restriction
  on property: has concept
  all values from: Concept
subclass of: Restriction
  on property: has concept
  some values from: Concept
subclass of: Restriction
  on property: has source
  all values from: Concept
subclass of: Restriction
  on property: has source
  some values from: Concept
subclass of: Restriction
  on property:
    inverse of: has note nlp
  some values from: Note
subclass of: Restriction
  on property: has section
  all values from: Concept
subclass of: Restriction
  on property: has section
  some values from: Concept
subclass of: Restriction
  on property: snippet
  all values from: string
subclass of: Restriction
  on property: snippet
  some values from: string
subclass of: Restriction
  on property: offset
  all values from: string
subclass of: Restriction
  on property: offset
  some values from: string
subclass of: Restriction
  on property: lexical variant
  all values from: string
subclass of: Restriction
  on property: lexical variant
  some values from: string
subclass of: Restriction
  on property: system
  all values from: string
subclass of: Restriction
  on property: system
  some values from: string
subclass of: Restriction
  on property: term exists
  all values from: string
subclass of: Restriction
  on property: term exists
  some values from: string
subclass of: Restriction
  on property: term temporal
  all values from: string
subclass of: Restriction
  on property: term temporal
  some values from: string
subclass of: Restriction
  on property: term modifiers
  all values from: string
subclass of: Restriction
  on property: term modifiers
  some values from: string
omop cdm name: note_nlp

DeviceExposure
type: Class
subclass of: Exposure
subclass of: Restriction
  on property:
    inverse of: has device exposure
  some values from: Person
subclass of: Restriction
  on property:
    inverse of: has device exposure
  some values from: BaseVisit
subclass of: Restriction
  on property: has unique device
  all values from: Thing
subclass of: Restriction
  on property: has unique device
  some values from: Thing
subclass of: Restriction
  on property: quantity
  all values from: integer
subclass of: Restriction
  on property: quantity
  some values from: integer
omop cdm name: device_exposure

Location
type: Class
subclass of: OmopCDMThing
subclass of: Restriction
  on property: source value
  all values from: string
subclass of: Restriction
  on property: source value
  some values from: string
subclass of: Restriction
  on property: address 1
  all values from: string
subclass of: Restriction
  on property: address 1
  some values from: string
subclass of: Restriction
  on property: address 2
  all values from: string
subclass of: Restriction
  on property: address 2
  some values from: string
subclass of: Restriction
  on property: city
  all values from: string
subclass of: Restriction
  on property: city
  some values from: string
subclass of: Restriction
  on property: state
  all values from: string
subclass of: Restriction
  on property: state
  some values from: string
subclass of: Restriction
  on property: zip
  all values from: string
subclass of: Restriction
  on property: zip
  some values from: string
subclass of: Restriction
  on property: county
  all values from: string
subclass of: Restriction
  on property: county
  some values from: string
subclass of: Restriction
  on property: country
  all values from: string
subclass of: Restriction
  on property: country
  some values from: string
subclass of: Restriction
  on property: latitude
  all values from: decimal
subclass of: Restriction
  on property: latitude
  some values from: decimal
subclass of: Restriction
  on property: longitude
  all values from: decimal
subclass of: Restriction
  on property: longitude
  some values from: decimal
omop cdm name: location

Relationship
type: Class
subclass of: OmopCDMThing
subclass of: Restriction
  on property: name
  all values from: string
subclass of: Restriction
  on property: name
  some values from: string
subclass of: Restriction
  on property: has concept
  all values from: Concept
subclass of: Restriction
  on property: has concept
  some values from: Concept
subclass of: Restriction
  on property: is hierarchical
  all values from: string
subclass of: Restriction
  on property: is hierarchical
  some values from: string
subclass of: Restriction
  on property: defines ancestry
  all values from: string
subclass of: Restriction
  on property: defines ancestry
  some values from: string
subclass of: Restriction
  on property: has reverse relationship
  all values from: Thing
subclass of: Restriction
  on property: has reverse relationship
  some values from: Thing
omop cdm name: relationship

ConditionEra
type: Class
subclass of: Era
subclass of: Restriction
  on property:
    inverse of: has condition era
  some values from: Person
subclass of: Restriction
  on property: occurrence count
  all values from: integer
subclass of: Restriction
  on property: occurrence count
  some values from: integer
omop cdm name: condition_era

Cost
type: Class
subclass of: OmopCDMThing
subclass of: Restriction
  on property: has concept
  all values from: Concept
subclass of: Restriction
  on property: has concept
  some values from: Concept
subclass of: Restriction
  on property: has type
  all values from: Concept
subclass of: Restriction
  on property: has type
  some values from: Concept
subclass of: Restriction
  on property: source value
  all values from: string
subclass of: Restriction
  on property: source value
  some values from: string
subclass of: Restriction
  on property: has source
  all values from: Concept
subclass of: Restriction
  on property: has source
  some values from: Concept
subclass of: Restriction
  on property: has event
  all values from: Thing
subclass of: Restriction
  on property: has event
  some values from: Thing
subclass of: Restriction
  on property: has event field
  all values from: Concept
subclass of: Restriction
  on property: has event field
  some values from: Concept
subclass of: Restriction
  on property:
    inverse of: has cost
  some values from: Person
subclass of: Restriction
  on property: has currency
  all values from: Concept
subclass of: Restriction
  on property: has currency
  some values from: Concept
subclass of: Restriction
  on property: cost
  all values from: decimal
subclass of: Restriction
  on property: cost
  some values from: decimal
subclass of: Restriction
  on property: incurred date
  all values from: date
subclass of: Restriction
  on property: incurred date
  some values from: date
subclass of: Restriction
  on property: billed date
  all values from: date
subclass of: Restriction
  on property: billed date
  some values from: date
subclass of: Restriction
  on property: paid date
  all values from: date
subclass of: Restriction
  on property: paid date
  some values from: date
subclass of: Restriction
  on property: has revenue code
  all values from: Concept
subclass of: Restriction
  on property: has revenue code
  some values from: Concept
subclass of: Restriction
  on property: has drg
  all values from: Concept
subclass of: Restriction
  on property: has drg
  some values from: Concept
subclass of: Restriction
  on property: revenue code source value
  all values from: string
subclass of: Restriction
  on property: revenue code source value
  some values from: string
subclass of: Restriction
  on property: drg source value
  all values from: string
subclass of: Restriction
  on property: drg source value
  some values from: string
subclass of: Restriction
  on property: has payer plan period
  all values from: PayerPlanPeriod
subclass of: Restriction
  on property: has payer plan period
  some values from: PayerPlanPeriod
omop cdm name: cost

VisitOccurrence
type: Class
subclass of: BaseVisit
subclass of: Restriction
  on property: has survey conduct
  all values from: SurveyConduct
subclass of: Restriction
  on property: has visit detail
  all values from: VisitDetail
subclass of: Restriction
  on property:
    inverse of: has visit occurrence
  some values from: Person
subclass of: Restriction
  on property: has admitting source
  all values from: Concept
subclass of: Restriction
  on property: has admitting source
  some values from: Concept
subclass of: Restriction
  on property: admitting source value
  all values from: string
subclass of: Restriction
  on property: admitting source value
  some values from: string
subclass of: Restriction
  on property: has preceding visit occurrence
  all values from: VisitOccurrence
subclass of: Restriction
  on property: has preceding visit occurrence
  some values from: VisitOccurrence
omop cdm name: visit_occurrence

Provider
type: Class
subclass of: BasePerson
subclass of: Restriction
  on property: name
  all values from: string
subclass of: Restriction
  on property: name
  some values from: string
subclass of: Restriction
  on property: year of birth
  all values from: integer
subclass of: Restriction
  on property: year of birth
  some values from: integer
subclass of: Restriction
  on property: npi
  all values from: string
subclass of: Restriction
  on property: npi
  some values from: string
subclass of: Restriction
  on property: dea
  all values from: string
subclass of: Restriction
  on property: dea
  some values from: string
subclass of: Restriction
  on property: has specialty
  all values from: Concept
subclass of: Restriction
  on property: has specialty
  some values from: Concept
subclass of: Restriction
  on property: specialty source value
  all values from: string
subclass of: Restriction
  on property: specialty source value
  some values from: string
subclass of: Restriction
  on property: has specialty source
  all values from: Concept
subclass of: Restriction
  on property: has specialty source
  some values from: Concept
omop cdm name: provider

CohortDefinition
type: Class
subclass of: OmopCDMThing
subclass of: Restriction
  on property: has subject
  all values from: Concept
subclass of: Restriction
  on property: has subject
  some values from: Concept
subclass of: Restriction
  on property: name
  all values from: string
subclass of: Restriction
  on property: name
  some values from: string
subclass of: Restriction
  on property: description
  all values from: string
subclass of: Restriction
  on property: description
  some values from: string
subclass of: Restriction
  on property: has definition type
  all values from: Concept
subclass of: Restriction
  on property: has definition type
  some values from: Concept
subclass of: Restriction
  on property: syntax
  all values from: string
subclass of: Restriction
  on property: syntax
  some values from: string
subclass of: Restriction
  on property: cohort initiation date
  all values from: date
subclass of: Restriction
  on property: cohort initiation date
  some values from: date
omop cdm name: cohort_definition

Domain
type: Class
subclass of: OmopCDMThing
subclass of: Restriction
  on property: name
  all values from: string
subclass of: Restriction
  on property: name
  some values from: string
subclass of: Restriction
  on property: has concept
  all values from: Concept
subclass of: Restriction
  on property: has concept
  some values from: Concept
omop cdm name: domain

ConceptRelationship
type: Class
subclass of: OmopCDMThing
subclass of: Restriction
  on property: has relationship
  all values from: Relationship
subclass of: Restriction
  on property: has relationship
  some values from: Relationship
subclass of: Restriction
  on property: valid start date
  all values from: date
subclass of: Restriction
  on property: valid start date
  some values from: date
subclass of: Restriction
  on property: valid end date
  all values from: date
subclass of: Restriction
  on property: valid end date
  some values from: date
subclass of: Restriction
  on property: invalid reason
  all values from: string
subclass of: Restriction
  on property: invalid reason
  some values from: string
subclass of: Restriction
  on property: concept id 1
  all values from: integer
subclass of: Restriction
  on property: concept id 1
  some values from: integer
subclass of: Restriction
  on property: concept id 2
  all values from: integer
subclass of: Restriction
  on property: concept id 2
  some values from: integer
omop cdm name: concept_relationship

Specimen
type: Class
subclass of: OmopCDMThing
subclass of: Event
subclass of: Restriction
  on property: has concept
  all values from: Concept
subclass of: Restriction
  on property: has concept
  some values from: Concept
subclass of: Restriction
  on property: has type
  all values from: Concept
subclass of: Restriction
  on property: has type
  some values from: Concept
subclass of: Restriction
  on property: source value
  all values from: string
subclass of: Restriction
  on property: source value
  some values from: string
subclass of: Restriction
  on property: has source
  all values from: Thing
subclass of: Restriction
  on property: has source
  some values from: Thing
subclass of: Restriction
  on property: quantity
  all values from: decimal
subclass of: Restriction
  on property: quantity
  some values from: decimal
subclass of: Restriction
  on property: has unit
  all values from: Concept
subclass of: Restriction
  on property: has unit
  some values from: Concept
subclass of: Restriction
  on property: unit source value
  all values from: string
subclass of: Restriction
  on property: unit source value
  some values from: string
subclass of: Restriction
  on property:
    inverse of: has specimen
  some values from: Person
subclass of: Restriction
  on property: has anatomic site
  all values from: Concept
subclass of: Restriction
  on property: has anatomic site
  some values from: Concept
subclass of: Restriction
  on property: has disease status
  all values from: Concept
subclass of: Restriction
  on property: has disease status
  some values from: Concept
subclass of: Restriction
  on property: anatomic site source value
  all values from: string
subclass of: Restriction
  on property: anatomic site source value
  some values from: string
subclass of: Restriction
  on property: disease status source value
  all values from: string
subclass of: Restriction
  on property: disease status source value
  some values from: string
omop cdm name: specimen

Metadata
type: Class
subclass of: OmopCDMThing
subclass of: Event
subclass of: Restriction
  on property: name
  all values from: string
subclass of: Restriction
  on property: name
  some values from: string
subclass of: Restriction
  on property: has concept
  all values from: Concept
subclass of: Restriction
  on property: has concept
  some values from: Concept
subclass of: Restriction
  on property: has type
  all values from: Concept
subclass of: Restriction
  on property: has type
  some values from: Concept
subclass of: Restriction
  on property: has value as concept
  all values from: Concept
subclass of: Restriction
  on property: has value as concept
  some values from: Concept
subclass of: Restriction
  on property: value as string
  all values from: string
subclass of: Restriction
  on property: value as string
  some values from: string
subclass of: Restriction
  on property: metadata date
  all values from: date
subclass of: Restriction
  on property: metadata date
  some values from: date
omop cdm name: metadata

ProcedureOccurrence
type: Class
subclass of: Occurrence
subclass of: Event
subclass of: Restriction
  on property: has concept
  all values from: Concept
subclass of: Restriction
  on property: has concept
  some values from: Concept
subclass of: Restriction
  on property: has type
  all values from: Concept
subclass of: Restriction
  on property: has type
  some values from: Concept
subclass of: Restriction
  on property: has provider
  all values from: Provider
subclass of: Restriction
  on property: has provider
  some values from: Provider
subclass of: Restriction
  on property: source value
  all values from: string
subclass of: Restriction
  on property: source value
  some values from: string
subclass of: Restriction
  on property: has source
  all values from: Concept
subclass of: Restriction
  on property: has source
  some values from: Concept
subclass of: Restriction
  on property: quantity
  all values from: integer
subclass of: Restriction
  on property: quantity
  some values from: integer
subclass of: Restriction
  on property:
    inverse of: has procedure occurrence
  some values from: Person
subclass of: Restriction
  on property:
    inverse of: has procedure occurrence
  some values from: BaseVisit
subclass of: Restriction
  on property: has modifier
  all values from: Concept
subclass of: Restriction
  on property: has modifier
  some values from: Concept
subclass of: Restriction
  on property: modifier source value
  all values from: string
subclass of: Restriction
  on property: modifier source value
  some values from: string
omop cdm name: procedure_occurrence

DrugExposure
type: Class
subclass of: Exposure
subclass of: Restriction
  on property: stop reason
  all values from: string
subclass of: Restriction
  on property: stop reason
  some values from: string
subclass of: Restriction
  on property: quantity
  all values from: decimal
subclass of: Restriction
  on property: quantity
  some values from: decimal
subclass of: Restriction
  on property:
    inverse of: has drug exposure
  some values from: Person
subclass of: Restriction
  on property:
    inverse of: has drug exposure
  some values from: BaseVisit
subclass of: Restriction
  on property: verbatim end date
  all values from: date
subclass of: Restriction
  on property: verbatim end date
  some values from: date
subclass of: Restriction
  on property: refills
  all values from: integer
subclass of: Restriction
  on property: refills
  some values from: integer
subclass of: Restriction
  on property: days supply
  all values from: integer
subclass of: Restriction
  on property: days supply
  some values from: integer
subclass of: Restriction
  on property: sig
  all values from: string
subclass of: Restriction
  on property: sig
  some values from: string
subclass of: Restriction
  on property: has route
  all values from: Concept
subclass of: Restriction
  on property: has route
  some values from: Concept
subclass of: Restriction
  on property: lot number
  all values from: string
subclass of: Restriction
  on property: lot number
  some values from: string
subclass of: Restriction
  on property: route source value
  all values from: string
subclass of: Restriction
  on property: route source value
  some values from: string
subclass of: Restriction
  on property: dose unit source value
  all values from: string
subclass of: Restriction
  on property: dose unit source value
  some values from: string
omop cdm name: drug_exposure

PayerPlanPeriod
type: Class
subclass of: OmopCDMThing
subclass of: DateDuration
subclass of: Restriction
  on property:
    inverse of: has payer plan period
  some values from: Person
subclass of: Restriction
  on property: has contract person
  all values from: Person
subclass of: Restriction
  on property: has contract person
  some values from: Person
subclass of: Restriction
  on property: has payer
  all values from: Concept
subclass of: Restriction
  on property: has payer
  some values from: Concept
subclass of: Restriction
  on property: payer source value
  all values from: string
subclass of: Restriction
  on property: payer source value
  some values from: string
subclass of: Restriction
  on property: has payer source
  all values from: Concept
subclass of: Restriction
  on property: has payer source
  some values from: Concept
subclass of: Restriction
  on property: has plan
  all values from: Concept
subclass of: Restriction
  on property: has plan
  some values from: Concept
subclass of: Restriction
  on property: plan source value
  all values from: string
subclass of: Restriction
  on property: plan source value
  some values from: string
subclass of: Restriction
  on property: has plan source
  all values from: Concept
subclass of: Restriction
  on property: has plan source
  some values from: Concept
subclass of: Restriction
  on property: has contract
  all values from: Concept
subclass of: Restriction
  on property: has contract
  some values from: Concept
subclass of: Restriction
  on property: contract source value
  all values from: integer
subclass of: Restriction
  on property: contract source value
  some values from: integer
subclass of: Restriction
  on property: has contract source
  all values from: Concept
subclass of: Restriction
  on property: has contract source
  some values from: Concept
subclass of: Restriction
  on property: has sponsor
  all values from: Concept
subclass of: Restriction
  on property: has sponsor
  some values from: Concept
subclass of: Restriction
  on property: sponsor source value
  all values from: string
subclass of: Restriction
  on property: sponsor source value
  some values from: string
subclass of: Restriction
  on property: has sponsor source
  all values from: Concept
subclass of: Restriction
  on property: has sponsor source
  some values from: Concept
subclass of: Restriction
  on property: family source value
  all values from: string
subclass of: Restriction
  on property: family source value
  some values from: string
subclass of: Restriction
  on property: has stop reason concept
  all values from: Concept
subclass of: Restriction
  on property: has stop reason concept
  some values from: Concept
subclass of: Restriction
  on property: stop reason source value
  all values from: string
subclass of: Restriction
  on property: stop reason source value
  some values from: string
subclass of: Restriction
  on property: has stop reason source
  all values from: Concept
subclass of: Restriction
  on property: has stop reason source
  some values from: Concept
omop cdm name: payer_plan_period